"Variant ID",vf,Location,"Chr: bp",vf_allele,Alleles,gmaf_allele,gmaf_freq,"Global MAF",Class,Source,Evidence,"Clin. Sig.","Conseq. Type",AA,"AA coord",sift_sort,sift_class,SIFT,polyphen_sort,polyphen_class,PolyPhen,cadd_sort,cadd_class,CADD,revel_sort,revel_class,REVEL,meta_lr_sort,meta_lr_class,MetaLR,mutation_assessor_sort,mutation_assessor_class,"Mutation Assessor",Transcript
rs1171880343,149794950,19:50976488,19:50976488,-,C/-,,,-,deletion,dbSNP,Frequency~TOPMed,,"3 prime UTR variant",,,,-,,,-,,,-,,,-,,,-,,,-,,ENST00000391807.5
rs1430906874,155234782,19:50976488,19:50976488,T,C/T,,,-,SNP,dbSNP,Frequency~TOPMed,,"3 prime UTR variant",,,,-,,,-,,,-,,,-,,,-,,,-,,ENST00000391807.5
rs1266097328,151775089,19:50976491,19:50976491,T,C/T,,,-,SNP,dbSNP,Frequency~TOPMed,,"3 prime UTR variant",,,,-,,,-,,,-,,,-,,,-,,,-,,ENST00000391807.5
rs1191635538,150209071,19:50976492,19:50976492,G,A/G,,,-,SNP,dbSNP,Frequency~TOPMed,,"3 prime UTR variant",,,,-,,,-,,,-,,,-,,,-,,,-,,ENST00000391807.5
rs139329452,142851985,19:50976493,19:50976493,T,C/T,T,0.000998403,"< 0.001",SNP,dbSNP,Frequency~1000Genomes~TOPMed~gnomAD,,"3 prime UTR variant",,,,-,,,-,,,-,,,-,,,-,,,-,,ENST00000391807.5
rs1236123901,151144481,19:50976498,19:50976498,G,A/G,,,-,SNP,dbSNP,Frequency~TOPMed,,"3 prime UTR variant",,,,-,,,-,,,-,,,-,,,-,,,-,,ENST00000391807.5
rs972949308,147738289,19:50976514,19:50976514,G,A/G,,,-,SNP,dbSNP,Frequency~TOPMed,,"3 prime UTR variant",,,,-,,,-,,,-,,,-,,,-,,,-,,ENST00000391807.5
rs1197819543,150340064,19:50976519,19:50976519,T,C/T,,,-,SNP,dbSNP,Frequency~TOPMed,,"3 prime UTR variant",,,,-,,,-,,,-,,,-,,,-,,,-,,ENST00000391807.5
rs1317496032,152853672,19:50976521,19:50976521,T,C/T,T,0.000998403,-,SNP,dbSNP,Frequency~TOPMed,,"3 prime UTR variant",,,,-,,,-,,,-,,,-,,,-,,,-,,ENST00000391807.5
rs115353923,142787068,19:50976525,19:50976525,T,C/T,T,0.00698882,0.007,SNP,dbSNP,Frequency~1000Genomes~TOPMed~gnomAD,,"3 prime UTR variant",,,,-,,,-,,,-,,,-,,,-,,,-,,ENST00000391807.5
rs1229925726,151014323,19:50976528,19:50976528,A,G/A,,,-,SNP,dbSNP,Frequency~TOPMed,,"3 prime UTR variant",,,,-,,,-,,,-,,,-,,,-,,,-,,ENST00000391807.5
rs1310444142,152705059,19:50976534,19:50976534,A,G/A,,,-,SNP,dbSNP,Frequency~TOPMed,,"3 prime UTR variant",,,,-,,,-,,,-,,,-,,,-,,,-,,ENST00000391807.5
rs950343206,147276329,19:50976548,19:50976548,A,G/A,,,-,SNP,dbSNP,Frequency~TOPMed~gnomAD,,"3 prime UTR variant",,,,-,,,-,,,-,,,-,,,-,,,-,,ENST00000391807.5
rs1387845201,154332659,19:50976560,19:50976560,C,T/C,T,0.00698882,-,SNP,dbSNP,Frequency~TOPMed,,"3 prime UTR variant",,,,-,,,-,,,-,,,-,,,-,,,-,,ENST00000391807.5
rs559075955,144375376,19:50976563,19:50976563,T,C/T,T,0.000199681,"< 0.001",SNP,dbSNP,Frequency~1000Genomes~TOPMed~gnomAD,,"3 prime UTR variant",,,,-,,,-,,,-,,,-,,,-,,,-,,ENST00000391807.5
rs1347234653,153478074,19:50976564,19:50976564,A,G/A,,,-,SNP,dbSNP,Frequency~TOPMed~gnomAD,,"3 prime UTR variant",,,,-,,,-,,,-,,,-,,,-,,,-,,ENST00000391807.5
rs903930685,146328718,19:50976568,19:50976568,T,C/T,,,-,SNP,dbSNP,Frequency~TOPMed,,"3 prime UTR variant",,,,-,,,-,,,-,,,-,,,-,,,-,,ENST00000391807.5
rs987247418,148030062,19:50976583,19:50976583,A,G/A,,,-,SNP,dbSNP,Frequency~TOPMed,,"3 prime UTR variant",,,,-,,,-,,,-,,,-,,,-,,,-,,ENST00000391807.5
rs911637090,146486036,19:50976587,19:50976587,G,A/G,T,0.000199681,-,SNP,dbSNP,Frequency~TOPMed~gnomAD,,"3 prime UTR variant",,,,-,,,-,,,-,,,-,,,-,,,-,,ENST00000391807.5
rs779014484,145736650,19:50976590,19:50976590,C,T/C,,,-,SNP,dbSNP,Frequency~TOPMed~gnomAD,,"3 prime UTR variant",,,,-,,,-,,,-,,,-,,,-,,,-,,ENST00000391807.5
rs1229500348,151005567,19:50976598,19:50976598,A,G/A/T,,,-,SNP,dbSNP,Frequency~TOPMed,,"3 prime UTR variant",,,,-,,,-,,,-,,,-,,,-,,,-,,ENST00000391807.5
rs1229500348,151005567,19:50976598,19:50976598,T,G/A/T,,,-,SNP,dbSNP,Frequency~TOPMed,,"3 prime UTR variant",,,,-,,,-,,,-,,,-,,,-,,,-,,ENST00000391807.5
rs1376522340,154092962,19:50976607,19:50976607,-,C/-,,,-,deletion,dbSNP,Frequency~TOPMed,,"3 prime UTR variant",,,,-,,,-,,,-,,,-,,,-,,,-,,ENST00000391807.5
rs1176231966,149886062,19:50976615,19:50976615,T,A/T,,,-,SNP,dbSNP,Frequency~TOPMed,,"3 prime UTR variant",,,,-,,,-,,,-,,,-,,,-,,,-,,ENST00000391807.5
rs867261602,145893643,19:50976619,19:50976619,T,C/T,,,-,SNP,dbSNP,Frequency~TOPMed,,"3 prime UTR variant",,,,-,,,-,,,-,,,-,,,-,,,-,,ENST00000391807.5
rs943236024,147130919,19:50976627,19:50976627,G,A/G,,,-,SNP,dbSNP,Frequency~TOPMed,,"3 prime UTR variant",,,,-,,,-,,,-,,,-,,,-,,,-,,ENST00000391807.5
rs1030960334,148922464,19:50976635,19:50976635,T,G/T,,,-,SNP,dbSNP,Frequency~TOPMed~gnomAD,,"3 prime UTR variant",,,,-,,,-,,,-,,,-,,,-,,,-,,ENST00000391807.5
rs891126098,146067112,19:50976636,19:50976636,T,G/T,,,-,SNP,dbSNP,Frequency~TOPMed,,"3 prime UTR variant",,,,-,,,-,,,-,,,-,,,-,,,-,,ENST00000391807.5
rs1458012122,155806242,19:50976640,19:50976640,-,C/-,,,-,deletion,dbSNP,Frequency~TOPMed,,"3 prime UTR variant",,,,-,,,-,,,-,,,-,,,-,,,-,,ENST00000391807.5
rs1008449634,148463085,19:50976644,19:50976644,G,C/G,,,-,SNP,dbSNP,Frequency~TOPMed~gnomAD,,"3 prime UTR variant",,,,-,,,-,,,-,,,-,,,-,,,-,,ENST00000391807.5
rs1018498299,148668035,19:50976653,19:50976653,A,T/A,,,-,SNP,dbSNP,Frequency~TOPMed,,"3 prime UTR variant",,,,-,,,-,,,-,,,-,,,-,,,-,,ENST00000391807.5
rs1482432258,156318957,19:50976658,19:50976658,C,T/C,,,-,SNP,dbSNP,Frequency~TOPMed,,"3 prime UTR variant",,,,-,,,-,,,-,,,-,,,-,,,-,,ENST00000391807.5
rs1288345431,152240765,19:50976659,19:50976659,T,C/T,,,-,SNP,dbSNP,Frequency~TOPMed~gnomAD,,"3 prime UTR variant",,,,-,,,-,,,-,,,-,,,-,,,-,,ENST00000391807.5
rs1235166513,151125228,19:50976665,19:50976665,-,T/-,,,-,deletion,dbSNP,Frequency~TOPMed,,"3 prime UTR variant",,,,-,,,-,,,-,,,-,,,-,,,-,,ENST00000391807.5
rs1350654282,153549243,19:50976670,19:50976670,G,T/G,,,-,SNP,dbSNP,Frequency~TOPMed,,"3 prime UTR variant",,,,-,,,-,,,-,,,-,,,-,,,-,,ENST00000391807.5
rs537786208,143897534,19:50976671,19:50976671,A,C/A,,,-,SNP,dbSNP,Frequency~gnomAD,,"3 prime UTR variant",,,,-,,,-,,,-,,,-,,,-,,,-,,ENST00000391807.5
rs1307647195,152647163,19:50976673,19:50976673,C,T/C,,,-,SNP,dbSNP,Frequency~TOPMed,,"3 prime UTR variant",,,,-,,,-,,,-,,,-,,,-,,,-,,ENST00000391807.5
rs1240103091,151229561,19:50976674,19:50976674,G,T/G,,,-,SNP,dbSNP,Frequency~TOPMed,,"3 prime UTR variant",,,,-,,,-,,,-,,,-,,,-,,,-,,ENST00000391807.5
rs964292586,147561405,19:50976679,19:50976679,T,A/T,,,-,SNP,dbSNP,Frequency~TOPMed~gnomAD,,"3 prime UTR variant",,,,-,,,-,,,-,,,-,,,-,,,-,,ENST00000391807.5
rs577425026,144788043,19:50976682,19:50976682,T,C/T,T,0.000998403,"< 0.001",SNP,dbSNP,Frequency~1000Genomes~TOPMed~gnomAD,,"3 prime UTR variant",,,,-,,,-,,,-,,,-,,,-,,,-,,ENST00000391807.5
rs1479230558,156251658,19:50976693,19:50976693,G,A/G,,,-,SNP,dbSNP,Frequency~TOPMed~gnomAD,,"3 prime UTR variant",,,,-,,,-,,,-,,,-,,,-,,,-,,ENST00000391807.5
rs544671243,144052299,19:50976713,19:50976713,T,C/T,T,0.000199681,"< 0.001",SNP,dbSNP,Frequency~1000Genomes,,"3 prime UTR variant",,,,-,,,-,,,-,,,-,,,-,,,-,,ENST00000391807.5
rs1175947409,149880213,19:50976715,19:50976715,T,A/T,,,-,SNP,dbSNP,Frequency~TOPMed~gnomAD,,"3 prime UTR variant",,,,-,,,-,,,-,,,-,,,-,,,-,,ENST00000391807.5
rs1302888758,152547587,19:50976717,19:50976717-50976720,-,TCTG/-,T,0.000998403,-,deletion,dbSNP,Frequency~TOPMed,,"3 prime UTR variant",,,,-,,,-,,,-,,,-,,,-,,,-,,ENST00000391807.5
rs1435984319,155341734,19:50976719,19:50976719,A,T/A,,,-,SNP,dbSNP,Frequency~TOPMed,,"3 prime UTR variant",,,,-,,,-,,,-,,,-,,,-,,,-,,ENST00000391807.5
rs1358104507,153706959,19:50976721,19:50976721,C,T/C,T,0.000199681,-,SNP,dbSNP,Frequency~TOPMed,,"3 prime UTR variant",,,,-,,,-,,,-,,,-,,,-,,,-,,ENST00000391807.5
rs1027151495,148844419,19:50976726,19:50976726,A,G/A,,,-,SNP,dbSNP,Frequency~TOPMed,,"3 prime UTR variant",,,,-,,,-,,,-,,,-,,,-,,,-,,ENST00000391807.5
rs951792456,147306001,19:50976730,19:50976730,A,C/A/T,,,-,SNP,dbSNP,Frequency~TOPMed,,"3 prime UTR variant",,,,-,,,-,,,-,,,-,,,-,,,-,,ENST00000391807.5
rs951792456,147306001,19:50976730,19:50976730,T,C/A/T,,,-,SNP,dbSNP,Frequency~TOPMed,,"3 prime UTR variant",,,,-,,,-,,,-,,,-,,,-,,,-,,ENST00000391807.5
rs1185227440,150075020,19:50976751,19:50976751-50976753,-,ATC/-,,,-,deletion,dbSNP,Frequency~TOPMed,,"3 prime UTR variant",,,,-,,,-,,,-,,,-,,,-,,,-,,ENST00000391807.5
rs1422251879,155053961,19:50976767,19:50976767,T,C/T,,,-,SNP,dbSNP,Frequency~TOPMed,,"3 prime UTR variant",,,,-,,,-,,,-,,,-,,,-,,,-,,ENST00000391807.5
rs372883291,143526029,19:50976768,19:50976768,A,G/A,A,0.000798722,"< 0.001",SNP,dbSNP,Frequency~1000Genomes~TOPMed~gnomAD,,"3 prime UTR variant",,,,-,,,-,,,-,,,-,,,-,,,-,,ENST00000391807.5
rs1211896132,150635746,19:50976774,19:50976774,T,G/T,,,-,SNP,dbSNP,Frequency~TOPMed,,"3 prime UTR variant",,,,-,,,-,,,-,,,-,,,-,,,-,,ENST00000391807.5
rs1486672269,156407977,19:50976784,19:50976784,A,G/A,,,-,SNP,dbSNP,Frequency~TOPMed,,"3 prime UTR variant",,,,-,,,-,,,-,,,-,,,-,,,-,,ENST00000391807.5
rs1283979757,152147663,19:50976788,19:50976788,A,T/A,,,-,SNP,dbSNP,Frequency~TOPMed,,"3 prime UTR variant",,,,-,,,-,,,-,,,-,,,-,,,-,,ENST00000391807.5
rs574928524,144731678,19:50976791,19:50976791,T,C/T,T,0.000199681,"< 0.001",SNP,dbSNP,Frequency~1000Genomes~TOPMed~gnomAD,,"3 prime UTR variant",,,,-,,,-,,,-,,,-,,,-,,,-,,ENST00000391807.5
rs1159939946,149543890,19:50976796,19:50976796,A,C/A/T,,,-,SNP,dbSNP,Frequency~TOPMed~gnomAD,,"3 prime UTR variant",,,,-,,,-,,,-,,,-,,,-,,,-,,ENST00000391807.5
rs1159939946,149543890,19:50976796,19:50976796,T,C/A/T,,,-,SNP,dbSNP,Frequency~TOPMed~gnomAD,,"3 prime UTR variant",,,,-,,,-,,,-,,,-,,,-,,,-,,ENST00000391807.5
rs1281638534,152099536,19:50976799,19:50976799,A,T/A,,,-,SNP,dbSNP,Frequency~TOPMed,,"3 prime UTR variant",,,,-,,,-,,,-,,,-,,,-,,,-,,ENST00000391807.5
rs939034462,147045402,19:50976801,19:50976801,T,G/T,,,-,SNP,dbSNP,Frequency~TOPMed,,"3 prime UTR variant",,,,-,,,-,,,-,,,-,,,-,,,-,,ENST00000391807.5
rs1052944433,149371457,19:50976809,19:50976809,G,A/G,,,-,SNP,dbSNP,Frequency~TOPMed~gnomAD,,"3 prime UTR variant",,,,-,,,-,,,-,,,-,,,-,,,-,,ENST00000391807.5
rs1423594758,155082688,19:50976812,19:50976812,C,T/C,,,-,SNP,dbSNP,Frequency~TOPMed~gnomAD,,"3 prime UTR variant",,,,-,,,-,,,-,,,-,,,-,,,-,,ENST00000391807.5
rs891822961,146081350,19:50976821,19:50976821,T,C/T,,,-,SNP,dbSNP,Frequency~TOPMed,,"3 prime UTR variant",,,,-,,,-,,,-,,,-,,,-,,,-,,ENST00000391807.5
rs1303434367,152558865,19:50976823,19:50976823,C,T/C,,,-,SNP,dbSNP,Frequency~TOPMed~gnomAD,,"3 prime UTR variant",,,,-,,,-,,,-,,,-,,,-,,,-,,ENST00000391807.5
rs950043764,147270205,19:50976824,19:50976824,G,C/G,,,-,SNP,dbSNP,Frequency~TOPMed,,"3 prime UTR variant",,,,-,,,-,,,-,,,-,,,-,,,-,,ENST00000391807.5
rs947985386,147227987,19:50976835,19:50976835,A,C/A/T,,,-,SNP,dbSNP,Frequency~TOPMed~gnomAD,,"3 prime UTR variant",,,,-,,,-,,,-,,,-,,,-,,,-,,ENST00000391807.5
rs947985386,147227987,19:50976835,19:50976835,T,C/A/T,,,-,SNP,dbSNP,Frequency~TOPMed~gnomAD,,"3 prime UTR variant",,,,-,,,-,,,-,,,-,,,-,,,-,,ENST00000391807.5
rs1043576229,149180286,19:50976836,19:50976836,A,G/A,,,-,SNP,dbSNP,Frequency~TOPMed~gnomAD,,"3 prime UTR variant",,,,-,,,-,,,-,,,-,,,-,,,-,,ENST00000391807.5
rs1457178009,155788114,19:50976839,19:50976839,G,C/G,,,-,SNP,dbSNP,Frequency~TOPMed,,"3 prime UTR variant",,,,-,,,-,,,-,,,-,,,-,,,-,,ENST00000391807.5
rs268883,142292006,19:50976847,19:50976847,C,T/C/G,T,0.373003,0.373,SNP,dbSNP,Frequency~1000Genomes~TOPMed~gnomAD,,"3 prime UTR variant",,,,-,,,-,,,-,,,-,,,-,,,-,,ENST00000391807.5
rs268883,142292006,19:50976847,19:50976847,G,T/C/G,T,0.373003,0.373,SNP,dbSNP,Frequency~1000Genomes~TOPMed~gnomAD,,"3 prime UTR variant",,,,-,,,-,,,-,,,-,,,-,,,-,,ENST00000391807.5
rs186810829,143191941,19:50976848,19:50976848,A,G/A/C,A,0.000199681,"< 0.001",SNP,dbSNP,Frequency~1000Genomes~TOPMed~gnomAD,,"3 prime UTR variant",,,,-,,,-,,,-,,,-,,,-,,,-,,ENST00000391807.5
rs186810829,143191941,19:50976848,19:50976848,C,G/A/C,A,0.000199681,"< 0.001",SNP,dbSNP,Frequency~1000Genomes~TOPMed~gnomAD,,"3 prime UTR variant",,,,-,,,-,,,-,,,-,,,-,,,-,,ENST00000391807.5
rs1242311680,151273442,19:50976854,19:50976854,T,C/T,,,-,SNP,dbSNP,Frequency~gnomAD,,"3 prime UTR variant",,,,-,,,-,,,-,,,-,,,-,,,-,,ENST00000391807.5
rs1193128895,150241348,19:50976856,19:50976856,G,A/G,,,-,SNP,dbSNP,Frequency~TOPMed,,"3 prime UTR variant",,,,-,,,-,,,-,,,-,,,-,,,-,,ENST00000391807.5
rs1052960982,149371761,19:50976857,19:50976857,A,C/A,,,-,SNP,dbSNP,Frequency~TOPMed,,"3 prime UTR variant",,,,-,,,-,,,-,,,-,,,-,,,-,,ENST00000391807.5
rs1001988373,148331120,19:50976858,19:50976858,G,A/G,,,-,SNP,dbSNP,Frequency~TOPMed~gnomAD,,"3 prime UTR variant",,,,-,,,-,,,-,,,-,,,-,,,-,,ENST00000391807.5
rs1208611105,150566824,19:50976859,19:50976859,G,T/G,,,-,SNP,dbSNP,Frequency~TOPMed,,"3 prime UTR variant",,,,-,,,-,,,-,,,-,,,-,,,-,,ENST00000391807.5
rs1356002271,153662054,19:50976863,19:50976863,A,G/A,,,-,SNP,dbSNP,Frequency~TOPMed,,"3 prime UTR variant",,,,-,,,-,,,-,,,-,,,-,,,-,,ENST00000391807.5
rs1274207864,151942655,19:50976871,19:50976871,A,G/A,,,-,SNP,dbSNP,Frequency~TOPMed,,"3 prime UTR variant",,,,-,,,-,,,-,,,-,,,-,,,-,,ENST00000391807.5
rs1234733428,151115971,19:50976873,19:50976873,T,C/T,,,-,SNP,dbSNP,Frequency~TOPMed,,"3 prime UTR variant",,,,-,,,-,,,-,,,-,,,-,,,-,,ENST00000391807.5
rs891103715,146066655,19:50976878,19:50976878,T,G/T,,,-,SNP,dbSNP,Frequency~TOPMed~gnomAD,,"3 prime UTR variant",,,,-,,,-,,,-,,,-,,,-,,,-,,ENST00000391807.5
rs1276984101,152001837,19:50976890,19:50976890,-,A/-,,,-,deletion,dbSNP,Frequency~TOPMed,,"3 prime UTR variant",,,,-,,,-,,,-,,,-,,,-,,,-,,ENST00000391807.5
rs1245478816,151341856,19:50976893,19:50976893,G,A/G,,,-,SNP,dbSNP,Frequency~gnomAD,,"3 prime UTR variant",,,,-,,,-,,,-,,,-,,,-,,,-,,ENST00000391807.5
rs528359481,143685726,19:50976901,19:50976901,T,C/T,T,0.000199681,"< 0.001",SNP,dbSNP,Frequency~1000Genomes~TOPMed,,"3 prime UTR variant",,,,-,,,-,,,-,,,-,,,-,,,-,,ENST00000391807.5
rs898634118,146220495,19:50976902,19:50976902,C,T/C,,,-,SNP,dbSNP,,,"3 prime UTR variant",,,,-,,,-,,,-,,,-,,,-,,,-,,ENST00000391807.5
rs1327707351,153068627,19:50976911,19:50976911,T,G/T,,,-,SNP,dbSNP,Frequency~TOPMed,,"3 prime UTR variant",,,,-,,,-,,,-,,,-,,,-,,,-,,ENST00000391807.5
rs144237877,142944767,19:50976914,19:50976914,A,G/A,A,0.000399361,"< 0.001",SNP,dbSNP,Frequency~1000Genomes~TOPMed,,"3 prime UTR variant",,,,-,,,-,,,-,,,-,,,-,,,-,,ENST00000391807.5
rs1008633773,148466822,19:50976916,19:50976916,G,A/G,,,-,SNP,dbSNP,Frequency~TOPMed,,"3 prime UTR variant",,,,-,,,-,,,-,,,-,,,-,,,-,,ENST00000391807.5
rs565048193,144509886,19:50976921,19:50976921,C,T/C,C,0.000199681,"< 0.001",SNP,dbSNP,Frequency~1000Genomes,,"3 prime UTR variant",,,,-,,,-,,,-,,,-,,,-,,,-,,ENST00000391807.5
rs1292817285,152334886,19:50976924,19:50976924,G,A/G,,,-,SNP,dbSNP,Frequency~TOPMed~gnomAD,,"3 prime UTR variant",,,,-,,,-,,,-,,,-,,,-,,,-,,ENST00000391807.5
rs1166909563,149690347,19:50976929,19:50976929,T,C/T,,,-,SNP,dbSNP,Frequency~TOPMed,,"3 prime UTR variant",,,,-,,,-,,,-,,,-,,,-,,,-,,ENST00000391807.5
rs1463209977,155915493,19:50976934,19:50976934,G,A/G,,,-,SNP,dbSNP,Frequency~TOPMed,,"3 prime UTR variant",,,,-,,,-,,,-,,,-,,,-,,,-,,ENST00000391807.5
rs1421812845,155044412,19:50976936,19:50976936,C,T/C,,,-,SNP,dbSNP,Frequency~TOPMed,,"3 prime UTR variant",,,,-,,,-,,,-,,,-,,,-,,,-,,ENST00000391807.5
rs1453631898,155713835,19:50976937,19:50976937,C,T/C,,,-,SNP,dbSNP,Frequency~TOPMed~gnomAD,,"3 prime UTR variant",,,,-,,,-,,,-,,,-,,,-,,,-,,ENST00000391807.5
rs1475758188,156177999,19:50976938,19:50976938,C,G/C,,,-,SNP,dbSNP,Frequency~TOPMed,,"3 prime UTR variant",,,,-,,,-,,,-,,,-,,,-,,,-,,ENST00000391807.5
rs536863316,143876608,19:50976952,19:50976952,T,C/T,,,-,SNP,dbSNP,Frequency~TOPMed~gnomAD,,"3 prime UTR variant",,,,-,,,-,,,-,,,-,,,-,,,-,,ENST00000391807.5
rs1232737388,151073162,19:50976963,19:50976963,C,T/C/G,,,-,SNP,dbSNP,Frequency~TOPMed~gnomAD,,"3 prime UTR variant",,,,-,,,-,,,-,,,-,,,-,,,-,,ENST00000391807.5
rs1232737388,151073162,19:50976963,19:50976963,G,T/C/G,,,-,SNP,dbSNP,Frequency~TOPMed~gnomAD,,"3 prime UTR variant",,,,-,,,-,,,-,,,-,,,-,,,-,,ENST00000391807.5
rs1451592784,155669472,19:50976967,19:50976967,T,C/T,,,-,SNP,dbSNP,Frequency~TOPMed,,"3 prime UTR variant",,,,-,,,-,,,-,,,-,,,-,,,-,,ENST00000391807.5
rs1254016218,151519887,19:50976972,19:50976972,T,G/T,,,-,SNP,dbSNP,Frequency~TOPMed,,"3 prime UTR variant",,,,-,,,-,,,-,,,-,,,-,,,-,,ENST00000391807.5
rs1025888431,148818575,19:50976973,19:50976973,G,A/G,,,-,SNP,dbSNP,Frequency~TOPMed,,"3 prime UTR variant",,,,-,,,-,,,-,,,-,,,-,,,-,,ENST00000391807.5
rs1481246247,156294332,19:50976976,19:50976976,T,C/T,,,-,SNP,dbSNP,Frequency~TOPMed~gnomAD,,"3 prime UTR variant",,,,-,,,-,,,-,,,-,,,-,,,-,,ENST00000391807.5
rs772284931,145552083,19:50976977,19:50976977,A,G/A,,,-,SNP,dbSNP,Frequency~TOPMed~gnomAD,,"3 prime UTR variant",,,,-,,,-,,,-,,,-,,,-,,,-,,ENST00000391807.5
rs532079237,143769333,19:50976978,19:50976978,T,G/T,T,0.000199681,"< 0.001",SNP,dbSNP,Frequency~1000Genomes,,"3 prime UTR variant",,,,-,,,-,,,-,,,-,,,-,,,-,,ENST00000391807.5
rs775721779,145646481,19:50976980,19:50976980,T,G/T,,,-,SNP,dbSNP,Frequency~TOPMed,,"3 prime UTR variant",,,,-,,,-,,,-,,,-,,,-,,,-,,ENST00000391807.5
rs1340777605,153343258,19:50976981,19:50976981,T,G/T,,,-,SNP,dbSNP,Frequency~TOPMed,,"3 prime UTR variant",,,,-,,,-,,,-,,,-,,,-,,,-,,ENST00000391807.5
rs191283017,143274565,19:50976982,19:50976982,C,T/C,C,0.00359425,0.004,SNP,dbSNP,Frequency~1000Genomes~TOPMed~gnomAD,,"3 prime UTR variant",,,,-,,,-,,,-,,,-,,,-,,,-,,ENST00000391807.5
rs1134784,142310280,19:50976991,19:50976991,A,G/A/C,,,-,SNP,dbSNP,Frequency~TOPMed~gnomAD,,"3 prime UTR variant",,,,-,,,-,,,-,,,-,,,-,,,-,,ENST00000391807.5
rs1134784,142310280,19:50976991,19:50976991,C,G/A/C,,,-,SNP,dbSNP,Frequency~TOPMed~gnomAD,,"3 prime UTR variant",,,,-,,,-,,,-,,,-,,,-,,,-,,ENST00000391807.5
rs1654529,142314261,19:50977003,19:50977003,G,T/G,G,0.0704872,0.070,SNP,dbSNP,Frequency~1000Genomes~TOPMed~gnomAD,,"3 prime UTR variant",,,,-,,,-,,,-,,,-,,,-,,,-,,ENST00000391807.5
rs1415539906,154911429,19:50977009,19:50977009,A,C/A,,,-,SNP,dbSNP,Frequency~gnomAD,,"3 prime UTR variant",,,,-,,,-,,,-,,,-,,,-,,,-,,ENST00000391807.5
rs1444369701,155517720,19:50977010,19:50977010,T,A/T,,,-,SNP,dbSNP,Frequency~TOPMed,,"3 prime UTR variant",,,,-,,,-,,,-,,,-,,,-,,,-,,ENST00000391807.5
rs80056616,142693887,19:50977011,19:50977011,C,T/C,C,0.0329473,0.033,SNP,dbSNP,Frequency~1000Genomes~TOPMed~gnomAD,,"3 prime UTR variant",,,,-,,,-,,,-,,,-,,,-,,,-,,ENST00000391807.5
rs575014126,144733573,19:50977026,19:50977026,G,C/G,,,-,SNP,dbSNP,Frequency~gnomAD,,"3 prime UTR variant",,,,-,,,-,,,-,,,-,,,-,,,-,,ENST00000391807.5
rs1354952869,153639602,19:50977028,19:50977028,C,G/C,,,-,SNP,dbSNP,Frequency~gnomAD,,"3 prime UTR variant",,,,-,,,-,,,-,,,-,,,-,,,-,,ENST00000391807.5
rs1448872843,155611618,19:50977031,19:50977031,G,A/G,,,-,SNP,dbSNP,Frequency~gnomAD,,"3 prime UTR variant",,,,-,,,-,,,-,,,-,,,-,,,-,,ENST00000391807.5
rs1004614391,148384788,19:50977044,"19: between 50977044 & 50977045",A,-/A,,,-,insertion,dbSNP,Frequency~TOPMed,,"3 prime UTR variant",,,,-,,,-,,,-,,,-,,,-,,,-,,ENST00000391807.5
rs1015070651,148598323,19:50977045,19:50977045,-,A/-,,,-,deletion,dbSNP,Frequency~TOPMed,,"3 prime UTR variant",,,,-,,,-,,,-,,,-,,,-,,,-,,ENST00000391807.5
rs960514993,147484373,19:50977050,19:50977050,G,A/G,,,-,SNP,dbSNP,Frequency~TOPMed~gnomAD,,"3 prime UTR variant",,,,-,,,-,,,-,,,-,,,-,,,-,,ENST00000391807.5
rs771979957,145543646,19:50977053,19:50977053,-,C/-,,,-,deletion,dbSNP,Frequency~TOPMed,,"3 prime UTR variant",,,,-,,,-,,,-,,,-,,,-,,,-,,ENST00000391807.5
rs118183979,142823543,19:50977056,19:50977056,T,C/T,T,0.00878594,0.009,SNP,dbSNP,Frequency~1000Genomes~TOPMed~gnomAD,,"3 prime UTR variant",,,,-,,,-,,,-,,,-,,,-,,,-,,ENST00000391807.5
rs763029932,145298117,19:50977057,19:50977057,A,G/A,,,-,SNP,dbSNP,Frequency~gnomAD,,"3 prime UTR variant",,,,-,,,-,,,-,,,-,,,-,,,-,,ENST00000391807.5
rs1396259559,154510289,19:50977068,19:50977068,T,C/T,,,-,SNP,dbSNP,Frequency~TOPMed,,"3 prime UTR variant",,,,-,,,-,,,-,,,-,,,-,,,-,,ENST00000391807.5
rs935819885,146979718,19:50977071,19:50977071,A,G/A,,,-,SNP,dbSNP,Frequency~TOPMed,,"3 prime UTR variant",,,,-,,,-,,,-,,,-,,,-,,,-,,ENST00000391807.5
rs988719257,148060220,19:50977074,19:50977074,C,T/C,,,-,SNP,dbSNP,Frequency~gnomAD,,"3 prime UTR variant",,,,-,,,-,,,-,,,-,,,-,,,-,,ENST00000391807.5
rs184539867,143150067,19:50977078,19:50977078,G,A/G,G,0.000199681,"< 0.001",SNP,dbSNP,Frequency~1000Genomes~TOPMed,,"3 prime UTR variant",,,,-,,,-,,,-,,,-,,,-,,,-,,ENST00000391807.5
rs1237962443,151182266,19:50977085,19:50977085,G,C/G,,,-,SNP,dbSNP,Frequency~TOPMed,,"3 prime UTR variant",,,,-,,,-,,,-,,,-,,,-,,,-,,ENST00000391807.5
rs913145356,146516693,19:50977087,19:50977087,C,A/C,,,-,SNP,dbSNP,,,"3 prime UTR variant",,,,-,,,-,,,-,,,-,,,-,,,-,,ENST00000391807.5
rs766366878,145389472,19:50977091,19:50977091,A,G/A,,,-,SNP,dbSNP,,,"3 prime UTR variant",,,,-,,,-,,,-,,,-,,,-,,,-,,ENST00000391807.5
rs950096056,147271280,19:50977095,19:50977095,G,C/G/T,,,-,SNP,dbSNP,Frequency~TOPMed,,"3 prime UTR variant",,,,-,,,-,,,-,,,-,,,-,,,-,,ENST00000391807.5
rs950096056,147271280,19:50977095,19:50977095,T,C/G/T,,,-,SNP,dbSNP,Frequency~TOPMed,,"3 prime UTR variant",,,,-,,,-,,,-,,,-,,,-,,,-,,ENST00000391807.5
rs79158434,142681858,19:50977098,19:50977098,C,T/C,C,0.000199681,"< 0.001",SNP,dbSNP,Frequency~1000Genomes~TOPMed~gnomAD,,"3 prime UTR variant",,,,-,,,-,,,-,,,-,,,-,,,-,,ENST00000391807.5
rs979349356,147868904,19:50977104,19:50977104,A,C/A/T,,,-,SNP,dbSNP,Frequency~TOPMed,,"3 prime UTR variant",,,,-,,,-,,,-,,,-,,,-,,,-,,ENST00000391807.5
rs979349356,147868904,19:50977104,19:50977104,T,C/A/T,,,-,SNP,dbSNP,Frequency~TOPMed,,"3 prime UTR variant",,,,-,,,-,,,-,,,-,,,-,,,-,,ENST00000391807.5
rs905828069,146367254,19:50977111,19:50977111,A,G/A,,,-,SNP,dbSNP,,,"3 prime UTR variant",,,,-,,,-,,,-,,,-,,,-,,,-,,ENST00000391807.5
rs751143916,144972723,19:50977138,19:50977138,C,A/C,,,-,SNP,dbSNP,Frequency~TOPMed,,"3 prime UTR variant",,,,-,,,-,,,-,,,-,,,-,,,-,,ENST00000391807.5
rs937458724,147013247,19:50977147,19:50977147,C,T/C,,,-,SNP,dbSNP,Frequency~TOPMed~gnomAD,,"3 prime UTR variant",,,,-,,,-,,,-,,,-,,,-,,,-,,ENST00000391807.5
rs1272731206,151912260,19:50977149,19:50977149,A,G/A,,,-,SNP,dbSNP,Frequency~gnomAD,,"3 prime UTR variant",,,,-,,,-,,,-,,,-,,,-,,,-,,ENST00000391807.5
rs1038842132,149083569,19:50977158,19:50977158,T,A/T,,,-,SNP,dbSNP,,,"3 prime UTR variant",,,,-,,,-,,,-,,,-,,,-,,,-,,ENST00000391807.5
rs1375795891,154077456,19:50977159,19:50977159,A,G/A,,,-,SNP,dbSNP,Frequency~TOPMed,,"3 prime UTR variant",,,,-,,,-,,,-,,,-,,,-,,,-,,ENST00000391807.5
rs898691599,146221671,19:50977165,19:50977165,C,T/C,,,-,SNP,dbSNP,Frequency~TOPMed~gnomAD,,"3 prime UTR variant",,,,-,,,-,,,-,,,-,,,-,,,-,,ENST00000391807.5
rs1052297694,149358230,19:50977168,19:50977168,C,T/C,,,-,SNP,dbSNP,Frequency~TOPMed,,"3 prime UTR variant",,,,-,,,-,,,-,,,-,,,-,,,-,,ENST00000391807.5
rs912632273,146506157,19:50977178,"19: between 50977178 & 50977179",T,-/T,,,-,insertion,dbSNP,Frequency~TOPMed~gnomAD,,"3 prime UTR variant",,,,-,,,-,,,-,,,-,,,-,,,-,,ENST00000391807.5
rs994328707,148174776,19:50977180,19:50977180,A,T/A,,,-,SNP,dbSNP,Frequency~gnomAD,,"3 prime UTR variant",,,,-,,,-,,,-,,,-,,,-,,,-,,ENST00000391807.5
rs944176637,147150010,19:50977183,19:50977183,G,T/G,,,-,SNP,dbSNP,Frequency~TOPMed~gnomAD,,"3 prime UTR variant",,,,-,,,-,,,-,,,-,,,-,,,-,,ENST00000391807.5
rs268884,142292007,19:50977190,19:50977190,C,T/C,C,0.0551118,0.055,SNP,dbSNP,Frequency~1000Genomes~TOPMed~gnomAD,,"3 prime UTR variant",,,,-,,,-,,,-,,,-,,,-,,,-,,ENST00000391807.5
rs1376174338,154085529,19:50977218,19:50977218,G,A/G,,,-,SNP,dbSNP,Frequency~TOPMed,,"3 prime UTR variant",,,,-,,,-,,,-,,,-,,,-,,,-,,ENST00000391807.5
rs1238780609,151200370,19:50977220,19:50977220,C,T/C,,,-,SNP,dbSNP,Frequency~TOPMed~gnomAD,,"3 prime UTR variant",,,,-,,,-,,,-,,,-,,,-,,,-,,ENST00000391807.5