Case Number,Date,Year,Type,Country,Area,Location,Activity,Name,Sex ,Age,Injury,Fatal (Y/N),Time,Species ,Investigator or Source,pdf,href formula,href,Case Number,Case Number,original order,,
2017.11.30.b,30-Nov-2017,2017,Unprovoked,COSTA RICA,Cocos Island,Manuelita,Scuba Diving,__ Jimenez,M,26,Serious injury to leg,N,,"Tiger shark, female",R. Arauz,2017.11.30.b-Jimenez.pdf,http://sharkattackfile.net/spreadsheets/pdf_directory/2017.11.30.b-Jimenez.pdf,http://sharkattackfile.net/spreadsheets/pdf_directory/2017.11.30.b-Jimenez.pdf,2017.11.30.b,2017.11.30.b,6221,,
2017.11.30.a,30-Nov-2017,2017,Unprovoked,COSTA RICA,Cocos Island,Manuelita,Scuba diving,Rohina Bhandari,F,49,FATAL,Y,,"Tiger shark, female",R. Arauz,2017.11.30.a-Bhandari.pdf,http://sharkattackfile.net/spreadsheets/pdf_directory/2017.11.30.a-Bhandari.pdf,http://sharkattackfile.net/spreadsheets/pdf_directory/2017.11.30.a-Bhandari.pdf,2017.11.30.a,2017.11.30.a,6220,,
2017.11.25.R,Reported 25-Nov-2017,2017,Sea Disaster,LIBYA,, Gars Garabulli,2 boats capsized,31 migrants,,,FATAL,Y,,Some drowned but other may have been killed by blue sharks,"TG Com 24, 11/25/2017",2017.11.25.R-Libya.pdf,http://sharkattackfile.net/spreadsheets/pdf_directory/2017.11.25.R-Libya.pdf,http://sharkattackfile.net/spreadsheets/pdf_directory/2017.11.25.R-Libya.pdf,2017.11.25.R,2017.11.25.R,6219,,
2017.11.24,24-Nov-2017,2017,Unprovoked,USA,California,"Stillwater Cove, Monterey County",Spearfishing,Grigor Azatian,M,25,Right leg bitten,N,13h45,"White shark, 4.6 m","R. Collier, GSAF",2017.11.24-Azatian.pdf,http://sharkattackfile.net/spreadsheets/pdf_directory/2017.11.24-Azatian.pdf,http://sharkattackfile.net/spreadsheets/pdf_directory/2017.11.24-Azatian.pdf,2017.11.24,2017.11.24,6218,,
2017.11.18,18-Nov-2017,2017,Unprovoked,USA,Florida,"Floridana Beach, Brevard County",Surfing,Kaia Anderson,F,14,Heel bitten,N,Late afternoon,,"Florida Today, 11/21/2017",2017.11.18-Anderson.pdf,http://sharkattackfile.net/spreadsheets/pdf_directory/2017.11.18-Anderson.pdf,http://sharkattackfile.net/spreadsheets/pdf_directory/2017.11.18-Anderson.pdf,2017.11.18,2017.11.18,6217,,
2017.11.13.R,Reported 13-Nov-2017,2017,Unprovoked,,,,Surfing,Timur Yunusov,M,24,Puncture wounds to feet,N,,,Instagram,2017.11.13.R-Timur.pdf,http://sharkattackfile.net/spreadsheets/pdf_directory/2017.11.13.R-Timur.pdf,http://sharkattackfile.net/spreadsheets/pdf_directory/2017.11.13.R-Timur.pdf,2017.11.13.R,2017.11.13.R,6216,,
2017.11.13,13-Nov-2017,2017,Unprovoked,AUSTRALIA,New South Wales,Avoca Beach,Surfing,Charlie Fry,M,25,Puncture wounds to left shoulder,N,16h00,2 m shark,"B. Myatt, GSAF",2017.11.13-Fry.pdf,http://sharkattackfile.net/spreadsheets/pdf_directory/2017.11.13-Fry.pdf,http://sharkattackfile.net/spreadsheets/pdf_directory/2017.11.13-Fry.pdf,2017.11.13,2017.11.13,6215,,
2017.11.04,04-Nov-2017,2017,Unprovoked,CUBA,Holquin Province,Guardalavaca Beach,Night bathing,Jes�s Cabrera Gonz�lez ,M,22,FATAL,Y,23h30,Tiger shark,TrackingSharks.com,2017.11.04-Cuba.pdf,http://sharkattackfile.net/spreadsheets/pdf_directory/2017.11.04-Cuba.pdf,http://sharkattackfile.net/spreadsheets/pdf_directory/2017.11.04-Cuba.pdf,2017.11.04,2017.11.04,6214,,
2017.10.31.R,Reported 31-Oct-2017,2017,Unprovoked,AUSTRALIA,Queensland,Magnetic Island,Snorkeling,Jack Tolley,M,7,Calf injured,N,,Cookiecutter shark,"Townsville Bulletin, 10/31/2017",2017.10.21.R-Tolley.pdf,http://sharkattackfile.net/spreadsheets/pdf_directory/2017.10.21.R-Tolley.pdf,http://sharkattackfile.net/spreadsheets/pdf_directory/2017.10.21.R-Tolley.pdf,2017.10.31.R,2017.10.31.R,6213,,
2017.10.28,28-Oct-2017,2017,Unprovoked,AUSTRALIA,New South Wales,Birubi Point,Surfing,male,M,31,Minor injury to foot,N,09h00,"Wobbegong shark, 1 m","B. Myatt, GSAF",2017.10.28-Birubi.pdf,http://sharkattackfile.net/spreadsheets/pdf_directory/2017.10.28-Birubi.pdf,http://sharkattackfile.net/spreadsheets/pdf_directory/2017.10.28-Birubi.pdf,2017.10.28,2017.10.28,6212,,
2017.10.26,26-Oct-2017,2017,Unprovoked,USA,Hawaii,"White Plains Beach, Oahu",Stand-Up Paddleboarding,male,M,,No injury but shark bit SUP,N,15h00,,"Hawaii News Now, 10/27/2017",2017.10.26-Oahu.pdf,http://sharkattackfile.net/spreadsheets/pdf_directory/2017.10.26-Oahu.pdf,http://sharkattackfile.net/spreadsheets/pdf_directory/2017.10.26-Oahu.pdf,2017.10.26,2017.10.26,6211,,
2017.10.23.c,23-Oct-2017,2017,Unprovoked,MAURITIUS,Pamplemousses ,Le Goulet,Swimming,male,M,,Minor injury to foot,N,Afternoon,,"J. LeBlanc, GSAF",2017.10.23.c-Mauritius.pdf,http://sharkattackfile.net/spreadsheets/pdf_directory/2017.10.23.c-Mauritius.pdf,http://sharkattackfile.net/spreadsheets/pdf_directory/2017.10.23.c-Mauritius.pdf,2017.10.23.c,2017.10.23.c,6210,,
2017.10.23.b,23-Oct-2017,2017,Unprovoked,USA,Florida,"Juno Beach, Palm Beach County",Surfing ,Jason Hartl,M,17,Lacerations to left foot,N,17h00,,"WPBF News, 10/24/2017",2017.10.23.b-Hartl.pdf,http://sharkattackfile.net/spreadsheets/pdf_directory/2017.10.23.b-Hartl.pdf,http://sharkattackfile.net/spreadsheets/pdf_directory/2017.10.23.b-Hartl.pdf,2017.10.23.b,2017.10.23.b,6209,,
2017.10.23.a,23-Oct-2017,2017,Unprovoked,USA,Florida,"Ocean Reef Park, Singer Island, Palm Beach County",Swimming,Susan Peteka,F,60,Severe lacerations to left hand & wrist,N,08h00,,"Palm Beach Post, 11/1/2017",2017.10.23.a-Peteka.pdf,http://sharkattackfile.net/spreadsheets/pdf_directory/2017.10.23.a-Peteka.pdf,http://sharkattackfile.net/spreadsheets/pdf_directory/2017.10.23.a-Peteka.pdf,2017.10.23.a,2017.10.23.a,6208,,
2017.10.22,22-Oct-2017,2017,Unprovoked,AUSTRALIA,South Australia,Normanville,Kayaking / Fishing,Sarah Williams,F,15,Minor injuries,N,Afternoon,"White shark, 4.5 m","Nine News, 10/22/2017",2017.10.22-Williams.pdf,http://sharkattackfile.net/spreadsheets/pdf_directory/2017.10.22-Williams.pdf,http://sharkattackfile.net/spreadsheets/pdf_directory/2017.10.22-Williams.pdf,2017.10.22,2017.10.22,6207,,
2017.10.18,18-Oct-2017,2017,Unprovoked,USA,Florida,"Lantana Beach, Palm Beach County",Swimming,Carlos Iribam,M,,Puncture wounds & lacerations to foot,N,14h30,"Spinner shark, 4 to 5 feet","WPTV, 10/19/2017",2017.10.18-Iribam.pdf,http://sharkattackfile.net/spreadsheets/pdf_directory/2017.10.18-Iribam.pdf,http://sharkattackfile.net/spreadsheets/pdf_directory/2017.10.2018-Iribam.pdf,2017.10.18,2017.10.18,6206,,
2017.10.09,09-Oct-2017,2017,Unprovoked,USA,Hawaii,"Davidsons Beach, Kekaha, Kauai",Surfing,Mitch Milan,M,54,Lacerations to left hand,N,18h30,"Tiger shark, 8 to 10 feet","Hawaii News Now, 10/10/2017",2017.10.09-Milan.pdf,http://sharkattackfile.net/spreadsheets/pdf_directory/2017.10.09-Milan.pdf,http://sharkattackfile.net/spreadsheets/pdf_directory/2017.10.09-Milan.pdf,2017.10.09,2017.10.09,6205,,
2017.10.05,05-Oct-2017,2017,Unprovoked,USA,Hawaii,"Kama�ole Beach Park, Maui ",Snorkeling,female,F,40,Abrasions,N,12h30,8' shark,"Maui Now, 10/5/2017",2017.10.05-Hawaii.pdf,http://sharkattackfile.net/spreadsheets/pdf_directory/2017.10.05-Hawaii.pdf,http://sharkattackfile.net/spreadsheets/pdf_directory/2017.10.05-Hawaii.pdf,2017.10.05,2017.10.05,6204,,
2017.10.01,01-Oct-2017,2017,Invalid,SOUTH AFRICA,Western Cape Province,Dyer Island,Scuba Diving,Bradley Fick,M,31,"FATAL,",,,,"All Africa, 10/11/2017 ",2017.10.01-Fick.pdf,http://sharkattackfile.net/spreadsheets/pdf_directory/2017.10.01-Fick.pdf,http://sharkattackfile.net/spreadsheets/pdf_directory/2017.10.01-Fick.pdf,2017.10.01,2017.10.01,6203,,
2017.09.25.b,25-Sep-2017,2017,Unprovoked,USA,Florida,"Hanna Park, Jacksonville, Duval County",Surfing,Justin White,M,,Lacerations to lower left leg and foot,N,Morning,5' shark,"News4Jax, 9/26/2017",2017.09.25.b-White.pdf,http://sharkattackfile.net/spreadsheets/pdf_directory/2017.09.25.b-White.pdf,http://sharkattackfile.net/spreadsheets/pdf_directory/2017.09.25.b-White.pdf,2017.09.25.b,2017.09.25.b,6202,,
2017.09.25.a,25-Sep-2017,2017,Unprovoked,AUSTRALIA,Western Australia,Gracetown,Surfing,Catherine Vissers,M,,"No injury, board damaged by shark",N,18h00,"White shark, 3.5 m","Stab Magazine, 9/26/2017",2017.09.25.a-Vissers.pdf,http://sharkattackfile.net/spreadsheets/pdf_directory/2017.09.25.a-Vissers.pdf,http://sharkattackfile.net/spreadsheets/pdf_directory/2017.09.25.a-Vissers.pdf,2017.09.25.a,2017.09.25.a,6201,,
2017.09.24.b,24-Sep-2017,2017,Invalid,USA,New York,Rockaway,Surfing,Michah Behrend,M,33,"Lacerations to right ankle, foot & toe",N,15h30,Questionable,"S. Curatolo-Wageman, GSAF",2017.09.24.b-Behrend.pdf,http://sharkattackfile.net/spreadsheets/pdf_directory/2017.09.24.b-Behrend.pdf,http://sharkattackfile.net/spreadsheets/pdf_directory/2017.09.24.b-Behrend.pdf,2017.09.24.b,2017.09.24.b,6200,,
2017.09.24.a,24-Sep-2017,2017,Unprovoked,USA,Florida,Fort Worth,Surfing,male,M,,Laceration to upper arm,N,14h00,4' to 5' shark,"Sun Sentinel, 9/24/2017",2017.09.24.a-FortWorth.pdf,http://sharkattackfile.net/spreadsheets/pdf_directory/2017.09.24.a-FortWorth.pdf,http://sharkattackfile.net/spreadsheets/pdf_directory/2017.09.24.a-FortWorth.pdf,2017.09.24.a,2017.09.24.a,6199,,
2017.09.20,20-Sep-2017,2017,Unprovoked,USA,Florida,Palm Beach County,Surfing,Richard Inniss,M,,Minor lacerations to sole of left foot,N,Morning,,"WPTV, 9/25/2017",2017.09.20-Inniss.pdf,http://sharkattackfile.net/spreadsheets/pdf_directory/2017.09.20-Inniss.pdf,http://sharkattackfile.net/spreadsheets/pdf_directory/2017.09.20-Inniss.pdf,2017.09.20,2017.09.20,6198,,
2017.09.16.b,16-Sep-2017,2017,Unprovoked,SPAIN,Canary Islands,Gran Canaria ,Body surfing,male,M,child,Lacerations to right foot,N,,"Porbeagle, 1.5 m",Turismo La Aldea,2017.09.16.b-GrandCanary.pdf,http://sharkattackfile.net/spreadsheets/pdf_directory/2017.09.16.b-GrandCanary.pdf,http://sharkattackfile.net/spreadsheets/pdf_directory/2017.09.16.b-GrandCanary.pdf,2017.09.16.b,2017.09.16.b,6197,,
2017.09.16.a,16-Sep-2017,2017,Unprovoked,USA,Florida,"Ponce Inlet, Volusia County",Surfing,male,M,28,Lacerations to left foot,N,16h30,,"Orlando Sentinel, 9/16/2017",2017.09.16.a-Volusia.pdf,http://sharkattackfile.net/spreadsheets/pdf_directory/2017.09.16.a-Volusia.pdf,http://sharkattackfile.net/spreadsheets/pdf_directory/2017.09.16.a-Volusia.pdf,2017.09.16.a,2017.09.16.a,6196,,
2017.09.15.b,15-Sep-2017,2017,Invalid,SOUTH AFRICA,Western Cape Province,Hawston,Scuba Diving,Wayon Love,M,25,"FATAL, but death was probably due to drowning",,Afternoon,,"Ground Up, 9/20/2017",2017.09.15.b-Love.pdf,http://sharkattackfile.net/spreadsheets/pdf_directory/2017.09.15.b-Love.pdf,http://sharkattackfile.net/spreadsheets/pdf_directory/2017.09.15.b-Love.pdf,2017.09.15.b,2017.09.15.b,6195,,
2017.09.15.a,15-Sep-2017,2017,,SAMOA, Upolu Island,Nofoali�i,Fishing,male,M,,Injuries to hands and legs,N,Night,,"Samoa Observer, 9/16/2017",2017.09.15.a-Samoa.pdf,http://sharkattackfile.net/spreadsheets/pdf_directory/2017.09.15.a-Samoa.pdf,http://sharkattackfile.net/spreadsheets/pdf_directory/2017.09.15.a-Samoa.pdf,2017.09.15.a,2017.09.15.a,6194,,
2017.09.14,Sep-2017,2017,Boating,AUSTRALIA,Westerm Australia,Esperance,Fishing,,,,"sharks rammed boats, no injury to occupants",N,,"White shark, 3.5m","B. Myatt, GSAF",2017.09.14-EsperanceBoats.pdf,http://sharkattackfile.net/spreadsheets/pdf_directory/2017.09.14-EsperanceBoats.pdf,http://sharkattackfile.net/spreadsheets/pdf_directory/2017.09.14-EsperanceBoats.pdf,2017.09.14,2017.09.14,6193,,
2017.09.10.b,10-Sep-2017,2017,Unprovoked,AUSTRALIA,Westerm Australia,Sam's Creek area,Swimming,male,M,,Minor injuries,N,15h00,,"West Australian, 9/11/2017",2017.09.10.b-Samson.pdf,http://sharkattackfile.net/spreadsheets/pdf_directory/2017.09.10.b-Samson.pdf,http://sharkattackfile.net/spreadsheets/pdf_directory/2017.09.10.b-Samson.pdf,2017.09.10.b,2017.09.10.b,6192,,
2017.09.10.a,10-Sep-2017,2017,Unprovoked,AUSTRALIA,New South Wales,Iluka Beach,Surfing,Abe McGrath,M,35,Minor lacerations to right hip,N,06h00,"White shark, 3 to 3.5m ","B. Myatt, GSAF",2017.09.10.a-McGrath.pdf,http://sharkattackfile.net/spreadsheets/pdf_directory/2017.09.10.a-McGrath.pdf,http://sharkattackfile.net/spreadsheets/pdf_directory/2017.09.10.a-McGrath.pdf,2017.09.10.a,2017.09.10.a,6191,,
2017.09.06.R,Reported 06-Sep-2017,2017,Unprovoked,SOLOMON ISLANDS,,Owarigi Island,Spearfishing,Bartholmew,M,,Foot bitten,N,,,BBC,2017.09.06-Bartholomew.pdf,http://sharkattackfile.net/spreadsheets/pdf_directory/2017.09.06-Bartholomew.pdf,http://sharkattackfile.net/spreadsheets/pdf_directory/2017.09.06-Bartholomew.pdf,2017.09.06.R,2017.09.06.R,6190,,
2017.09.03.b,03-Sep-2017,2017,Unprovoked,SOUTH AFRICA,Western Cape Province,Dyer Island,"Swimming, poaching abalone",Sivuyile Xelela,M,,FATAL,Y,Morning,,"All Africa, 10/11/2017",2017.09.03.b-Xelela.pdf,http://sharkattackfile.net/spreadsheets/pdf_directory/2017.09.03.b-Xelela.pdf,http://sharkattackfile.net/spreadsheets/pdf_directory/2017.09.03.b-Xelela.pdf,2017.09.03.b,2017.09.03.b,6189,,
2017.09.03.a,03-Sep-2017,2017,Unprovoked,JAPAN,Shizuoka Prefecture,Iwata City,Surfing,male,M,42,Injury to ankle & feet,N,10h00,,"Japan Today, 9/4/2017",2017.09.03.a-Japan.pdf,http://sharkattackfile.net/spreadsheets/pdf_directory/2017.09.03.a-Japan.pdf,http://sharkattackfile.net/spreadsheets/pdf_directory/2017.09.03.a-Japan.pdf,2017.09.03.a,2017.09.03.a,6188,,
2017.09.02.c,02-Sep-2017,2017,Unprovoked,USA,Florida,"Marathon, Monroe County",Swimming,Ervin Maccarty,M,,Lacerations to abdomen,,,Nurse shark,NewsFlare,2017.09.02.c-Maccarty.pdf,http://sharkattackfile.net/spreadsheets/pdf_directory/2017.09.02.c-Maccarty.pdf,http://sharkattackfile.net/spreadsheets/pdf_directory/2017.09.02.c-Maccarty.pdf,2017.09.02.c,2017.09.02.c,6187,,
2017.09.02.b,02-Sep-2017,2017,Unprovoked,USA,Texas,"South Padre Island, Cameron County",Swimming,female,F,,Lacerations to foot,N,,,"Brownsville Herald, 9/5/2017",2017.09.02.b-SouthPadre.pdf,http://sharkattackfile.net/spreadsheets/pdf_directory/2017.09.02.b-SouthPadre.pdf,http://sharkattackfile.net/spreadsheets/pdf_directory/2017.09.02.b-SouthPadre.pdf,2017.09.02.b,2017.09.02.b,6186,,
2017.09.02.a,02-Sep-2017,2017,Unprovoked,USA,Florida,"New Smyrna Beach, Volusia County",Surfing,Chase Elmore,M,17,Minor injury to right hand,N,10h44,,"Click Orlando, 9/2/2017",2017.09.02.a-Elmore.pdf,http://sharkattackfile.net/spreadsheets/pdf_directory/2017.09.02.a-Elmore.pdf,http://sharkattackfile.net/spreadsheets/pdf_directory/2017.09.02.a-Elmore.pdf,2017.09.02.a,2017.09.02.a,6185,,
2017.08.29,29-Aug-2017,2017,Unprovoked,AUSTRALIA,Victoria,Cathedral Rock,Surfing,Marcel Brundler,M,37,"No injury, board bitten",N,10h30,"White shark, 3 m","B. Myatt, GSAF",2017.08.27-Brundler.pdf,http://sharkattackfile.net/spreadsheets/pdf_directory/2017.08.27-Brundler.pdf,http://sharkattackfile.net/spreadsheets/pdf_directory/http://sharkattackfile.net/spreadsheets/pdf_directory/2017.08.27-Brundler.pdf,2017.08.29,2017.08.29,6184,,
2017.08.27,27-Aug-2017,2017,Unprovoked,USA,Florida,Bathtub Beach ,Wading,Violet Veatch,F,3,Leg injured,N,13h19,,"Sun Sentinel, 8/27/2017",2017.08.27-Veatch.pdf,http://sharkattackfile.net/spreadsheets/pdf_directory/2017.08.27-Veatch.pdf,http://sharkattackfile.net/spreadsheets/pdf_directory/2017.08.27-Veatch.pdf,2017.08.27,2017.08.27,6183,,
2017.08.26.b,26-Aug-2017,2017,Invalid,SPAIN,Castell�n,Grao de Moncofa,Swimming,female,F,11,Lacerations to left foot,N,Midday,Shark involvement questionable,"El Periodico Mediterraneo, 8/27/2017",2017.08.26.b-Spain.pdf,http://sharkattackfile.net/spreadsheets/pdf_directory/2017.08.26.b-Spain.pdf,http://sharkattackfile.net/spreadsheets/pdf_directory/2017.08.26.b-Spain.pdf,2017.08.26.b,2017.08.26.b,6182,,
2017.08.26.a,26-Aug-2017,2017,Unprovoked,NEW ZEALAND,North Island,Off Tutukaka,Canoeing,Matt Kensington,M,,"No injury, shark bit canoe",N,,,"C.Black, GSAF",2017.08.26.a-Kensington.pdf,http://sharkattackfile.net/spreadsheets/pdf_directory/2017.08.26.a-Kensington.pdf,http://sharkattackfile.net/spreadsheets/pdf_directory/2017.08.26.a-Kensington.pdf,2017.08.26.a,2017.08.26.a,6181,,
2017.08.23,23-Aug-2017,2017,Unprovoked,USA,Massachusetts,"Marconi Beach, Wellfleet, Barnstable County",SUP,Cleveland Bigelow,M,69,Not injured by shark but board bitten,N,10h00,"White shark, 5' to 7'","Cape Cod Times, 8/23/2017",2017.08.23-Bigelow.pdf,http://sharkattackfile.net/spreadsheets/pdf_directory/2017.08.23-Bigelow.pdf,http://sharkattackfile.net/spreadsheets/pdf_directory/2017.08.23-Bigelow.pdf,2017.08.23,2017.08.23,6180,,
2017.08.18,18-Aug-2017,2017,Unprovoked,BAHAMAS,,,Spearfishing,male,M,,Hand injured,N,15h00,5' shark,"CBS12, 8/18/2017",2017.08.18-JupiterDiver.pdf,http://sharkattackfile.net/spreadsheets/pdf_directory/2017.08.18-JupiterDiver.pdf,http://sharkattackfile.net/spreadsheets/pdf_directory/2017.08.18-JupiterDiver.pdf,2017.08.18,2017.08.18,6179,,
2017.08.10,10-Aug-2017,2017,Unprovoked,USA,South Carolina,"Sea Pines Resort, Hilton Head Island, Beaufort County",Swimming,Linton Suttle,M,13,Minor cuts to sole & toes of left foot,N,13h30,Possibly a juvenile blacktip shark,"C. Creswell, GSAF",2017.08.10-Suttle.pdf,http://sharkattackfile.net/spreadsheets/pdf_directory/2017.08.10-Suttle.pdf,http://sharkattackfile.net/spreadsheets/pdf_directory/2017.08.10-Suttle.pdf,2017.08.10,2017.08.10,6178,,
2017.08.05,05-Aug-2017,2017,Unprovoked,EGYPT,Red Sea Protectorate,Marsa Ghalib,Snorkeling,Kirsten Schachinger,F,20,Bite to right leg/hip,N,,"Oceanic whitetip shark, 1.8 to 2 m","Egyptian government, 8/5/2017",2017.08.05-Schachinger.pdf,http://sharkattackfile.net/spreadsheets/pdf_directory/2017.08.05-Schachinger.pdf,http://sharkattackfile.net/spreadsheets/pdf_directory/2017.08.05-Schachinger.pdf,2017.08.05,2017.08.05,6177,,
2017.08.03,03-Aug-2017,2017,Provoked,USA,Massachusetts,"Menauhant Beach, Falmouth,
Barnstable County",Fishing,male,M,34,Foot bitten by landed shark PROVOKED INCIDENT,N,23h30,4' shark,"MassLive, 8/4/2017",2017.08.03-Massachusetts.pdf,http://sharkattackfile.net/spreadsheets/pdf_directory/2017.08.03-Massachusetts.pdf,http://sharkattackfile.net/spreadsheets/pdf_directory/2017.08.03-Massachusetts.pdf,2017.08.03,2017.08.03,6176,,
2017.08.01,01-Aug-2017,2017,Boating,USA,California,"Between Pescadero Point & Bean Hollow Beach, San Mateo County",Kayaking / Fishing,Patrick Conroy,M,,"No injury, bow of kayak bitten",N,10h45,"White shark, 10'","R. Collier, GSAF",2017.08.01-Conroy.pdf,http://sharkattackfile.net/spreadsheets/pdf_directory/2017.08.01-Conroy.pdf,http://sharkattackfile.net/spreadsheets/pdf_directory/2017.08.01-Conroy.pdf,2017.08.01,2017.08.01,6175,,
2017.07.29.c,29-Jul-2017,2017,Invalid,USA,South Carolina,"Hilton Head Island, Beaufort County",Swimming,Johnny Simatacolos,M,10,Abrasions and cuts to sole of foot,N,15h00,Shark involvement not confirmed,"C. Creswell, GSAF",2017.07.29.c-Simatacolos.pdf,http://sharkattackfile.net/spreadsheets/pdf_directory/2017.07.29.c-Simatacolos.pdf,http://sharkattackfile.net/spreadsheets/pdf_directory/2017.07.29.c-Simatacolos.pdf,2017.07.29.c,2017.07.29.c,6174,,
2017.07.29.a,29-Jul-2017,2017,Unprovoked,USA,South Carolina,"DeBordieu Colony, Georgetown County",,female x 2,F,12,Bite to left thigh / minor injury,N,Afternoon,,"C. Creswell, GSAF",2017.07.29.a-Georgetown.pdf,http://sharkattackfile.net/spreadsheets/pdf_directory/2017.07.29.a-Georgetown.pdf,http://sharkattackfile.net/spreadsheets/pdf_directory/2017.07.29.a-Georgetown.pdf,2017.07.29.a,2017.07.29.a,6173,,
2017.07.27,27-Jul-2017,2017,Unprovoked,BAHAMAS,New Providence District,Rose Island,Snorkeling,female,F,,Foot & ankle injured,N,,,"R. Rolle, Tribune 242,  7/28/2017",2017.07.27-Bahamas.pdf,http://sharkattackfile.net/spreadsheets/pdf_directory/2017.07.27-Bahamas.pdf,http://sharkattackfile.net/spreadsheets/pdf_directory/2017.07.27-Bahamas.pdf,2017.07.27,2017.07.27,6172,,
2017.07.26.R,Reported 26-Jul-2017,2017,Unprovoked,BAHAMAS,40 miles off Grand Bahama Island,,Spearfishing,Michael Massey,M,,Severe lacerations to left hand,N,,,"RevistaJaraysedal.es, 7/26/2017",2017.07.26.R-Massey.pdf,http://sharkattackfile.net/spreadsheets/pdf_directory/2017.07.26.R-Massey.pdf,http://sharkattackfile.net/spreadsheets/pdf_directory/2017.07.26.R-Massey.pdf,2017.07.26.R,2017.07.26.R,6171,,
2017.07.24,24-Jul-2017,2017,Unprovoked,"ST HELENA, British overseas territory",Ascension Island,English Bay,Surfing,Kawika Matsu,M,37,Torso bitten,N,17h00,,"Telegraph UK, 7/28/2017",2017.07.24-Matsu.pdf,http://sharkattackfile.net/spreadsheets/pdf_directory/2017.07.24-Matsu.pdf,http://sharkattackfile.net/spreadsheets/pdf_directory/2017.07.24-Matsu.pdf,2017.07.24,2017.07.24,6170,,
2017.07.23.b,23-Jul-2017,2017,Unprovoked,USA,New Jersey,Ventnor,,Isabella Smith,F,,Minor injury to hand,N,,Sandtiger shark  2',A. Smith,2017.07.23.b-Smith.pdf,http://sharkattackfile.net/spreadsheets/pdf_directory/2017.07.23.b-Smith.pdf,http://sharkattackfile.net/spreadsheets/pdf_directory/2017.07.23.b-Smith.pdf,2017.07.23.b,2017.07.23.b,6169,,
2017.07.23.a,23-Jul-2017,2017,Unprovoked,SPAIN,Majorca,"Estanys Beach, Colonia de Sant",Swimming,female,F,,Abrasion to arm from shark's rough skin,N,Afternoon,Blue shark 6',"Daily Record, 7/24/2017",2017.07.23.a-Majorca.pdf,http://sharkattackfile.net/spreadsheets/pdf_directory/2017.07.23.a-Majorca.pdf,http://sharkattackfile.net/spreadsheets/pdf_directory/2017.07.23.a-Majorca.pdf,2017.07.23.a,2017.07.23.a,6168,,
2017.07.22,22-Jul-2017,2017,Unprovoked,USA,Florida,"Snipes Point, Monroe County",,female,F,40,Foot bitten,N,12h30,"""A small shark""","NBC Miami, 7/23/2017",2017.07.22-Keys.pdf,http://sharkattackfile.net/spreadsheets/pdf_directory/2017.07.22-Keys.pdf,http://sharkattackfile.net/spreadsheets/pdf_directory/2017.07.22-Keys.pdf,2017.07.22,2017.07.22,6167,,
2017.07.20.c,20-Jul-2017,2017,Invalid,USA,South Carolina,"Hilton Head Island, Beaufort County",Swimming,Ellie Rogier,F,8,Foot injured,N,,Shark involvement not confirmed,"C. Creswell, GSAF",2017.07.20.c-Rogier.pdf,http://sharkattackfile.net/spreadsheets/pdf_directory/2017.07.20.c-Rogier.pdf,http://sharkattackfile.net/spreadsheets/pdf_directory/2017.07.20.c-Rogier.pdf,2017.07.20.c,2017.07.20.c,6166,,
2017.07.20.b,20-Jul-2017,2017,Boating,USA,California,"Stearns Wharf, Santa Barbara",Kayaking,Bret Jackson,M,40,"No injury, kayak bitten",N,11h20,"White shark, 11' to 13'","R. Collier, GSAF",2017.07.20.b-Jackson.pdf,http://sharkattackfile.net/spreadsheets/pdf_directory/2017.07.20.b-Jackson.pdf,http://sharkattackfile.net/spreadsheets/pdf_directory/2017.07.20.b-Jackson.pdf,2017.07.20.b,2017.07.20.b,6165,,
2017.07.20.a,20-Jul-2017,2017,Unprovoked,USA,California,"Seal Rock, Goleta Beach, Santa Barbara",SUP,Rolf Geyling,M,50,"No injury, shark bit paddleboard",N,07h45,"White shark, 8' to 10'","R. Collier, GSAF",2017.07.20.a-Geyling.pdf,http://sharkattackfile.net/spreadsheets/pdf_directory/2017.07.20.a-Geyling.pdf,http://sharkattackfile.net/spreadsheets/pdf_directory/2017.07.20.a-Geyling.pdf,2017/07.20.a,2017.07.20.a,6164,,
2017.07.16,16-Jul-2017,2017,Unprovoked,USA,Washington,"South Beach, Westport, Grays Harbor County",Surfing,MK,M,,Pulled off board by shark but no injury,N,06h30,"White shark, 9'","R. Collier, GSAF",2017.07.16-Washington.pdf,http://sharkattackfile.net/spreadsheets/pdf_directory/2017.07.16-Washington.pdf,http://sharkattackfile.net/spreadsheets/pdf_directory/2017.07.16-Washington.pdf,2017.07.16,2017.07.16,6163,,
2017.07.11,11-Jul-2017,2017,Boating,USA,California,"Santa Cruz, Santa Cruz County",Kayaking,Steve Lawson,M,,"No injury, kayak bitten",N,11h00,White shark,"R. Collier, GSAF",2017.07.11-Lawson.pdf,http://sharkattackfile.net/spreadsheets/pdf_directory/2017.07.11-Lawson.pdf,http://sharkattackfile.net/spreadsheets/pdf_directory/2017.07.11-Lawson.pdf,2017.07.11,2017.07.11,6162,,
2017.07.09,09-Jul-2017,2017,Unprovoked,USA,Florida,"Haulover Beach, Miami-Dade County",Swimming,Elvin Lanza,M,46,Lower legs bitten,N,15h30,"Bull shark, 4' to 5'","Miami-Beach Patch, 7/9/2017",2017.07.09-Lanza.pdf,http://sharkattackfile.net/spreadsheets/pdf_directory/2017.07.09-Lanza.pdf,http://sharkattackfile.net/spreadsheets/pdf_directory/2017.07.09-Lanza.pdf,2017.07.09,2017.07.09,6161,,