"Variant ID",vf,Location,"Chr: bp",vf_allele,Alleles,gmaf_allele,gmaf_freq,"Global MAF",Class,Source,Evidence,"Clin. Sig.","Conseq. Type",AA,"AA coord",sift_sort,sift_class,SIFT,polyphen_sort,polyphen_class,PolyPhen,cadd_sort,cadd_class,CADD,revel_sort,revel_class,REVEL,meta_lr_sort,meta_lr_class,MetaLR,mutation_assessor_sort,mutation_assessor_class,"Mutation Assessor",Transcript
rs1426374679,14374230,20:5114954,20:5114954,T,G/T,,,-,SNP,dbSNP,Frequency~TOPMed,,"3 prime UTR variant",,,,-,,,-,,,-,,,-,,,-,,,-,,ENST00000379160.3
rs1000473176,7144410,20:5114959,20:5114959,C,T/C,,,-,SNP,dbSNP,Frequency~TOPMed~gnomAD,,"3 prime UTR variant",,,,-,,,-,,,-,,,-,,,-,,,-,,ENST00000379160.3
rs976416280,6626206,20:5114964,20:5114964,T,A/T,,,-,SNP,dbSNP,Frequency~TOPMed,,"3 prime UTR variant",,,,-,,,-,,,-,,,-,,,-,,,-,,ENST00000379160.3
rs577155052,3749655,20:5114967,20:5114967,T,C/T,,,-,SNP,dbSNP,Frequency~TOPMed~gnomAD,,"3 prime UTR variant",,,,-,,,-,,,-,,,-,,,-,,,-,,ENST00000379160.3
rs956288710,6193517,20:5114969,20:5114969,G,A/G,,,-,SNP,dbSNP,Frequency~TOPMed~gnomAD,,"3 prime UTR variant",,,,-,,,-,,,-,,,-,,,-,,,-,,ENST00000379160.3
rs951238633,6084747,20:5114970,20:5114970,A,G/A/C,,,-,SNP,dbSNP,Frequency~TOPMed~gnomAD,,"3 prime UTR variant",,,,-,,,-,,,-,,,-,,,-,,,-,,ENST00000379160.3
rs951238633,6084747,20:5114970,20:5114970,C,G/A/C,,,-,SNP,dbSNP,Frequency~TOPMed~gnomAD,,"3 prime UTR variant",,,,-,,,-,,,-,,,-,,,-,,,-,,ENST00000379160.3
rs982547821,6758348,20:5114971,20:5114971,C,T/C,,,-,SNP,dbSNP,Frequency~TOPMed~gnomAD,,"3 prime UTR variant",,,,-,,,-,,,-,,,-,,,-,,,-,,ENST00000379160.3
rs537378145,2871674,20:5114974,20:5114974,T,C/T,T,0.000399361,"< 0.001",SNP,dbSNP,Frequency~1000Genomes~TOPMed,,"3 prime UTR variant",,,,-,,,-,,,-,,,-,,,-,,,-,,ENST00000379160.3
rs909731914,5191793,20:5114986,20:5114986,G,T/G,,,-,SNP,dbSNP,,,"3 prime UTR variant",,,,-,,,-,,,-,,,-,,,-,,,-,,ENST00000379160.3
rs1019074254,7544610,20:5114990,20:5114990,C,A/C,,,-,SNP,dbSNP,Frequency~TOPMed,,"3 prime UTR variant",,,,-,,,-,,,-,,,-,,,-,,,-,,ENST00000379160.3
rs966534931,6413822,20:5114991,20:5114991,C,A/C,,,-,SNP,dbSNP,Frequency~TOPMed,,"3 prime UTR variant",,,,-,,,-,,,-,,,-,,,-,,,-,,ENST00000379160.3
rs191891769,2349920,20:5114993,20:5114993,G,C/G,,,-,SNP,dbSNP,Frequency~1000Genomes~TOPMed~gnomAD,,"3 prime UTR variant",,,,-,,,-,,,-,,,-,,,-,,,-,,ENST00000379160.3
rs941191407,5868998,20:5114995,20:5114995,G,A/G,,,-,SNP,dbSNP,Frequency~TOPMed~gnomAD,,"3 prime UTR variant",,,,-,,,-,,,-,,,-,,,-,,,-,,ENST00000379160.3
rs980546234,6715381,20:5114996,20:5114996,C,T/C,,,-,SNP,dbSNP,Frequency~TOPMed~gnomAD,,"3 prime UTR variant",,,,-,,,-,,,-,,,-,,,-,,,-,,ENST00000379160.3
rs1400571813,13800223,20:5114997,20:5114997,C,T/C,,,-,SNP,dbSNP,,,"3 prime UTR variant",,,,-,,,-,,,-,,,-,,,-,,,-,,ENST00000379160.3
rs1375670934,13248060,20:5114998,20:5114998,-,C/-,,,-,deletion,dbSNP,Frequency~TOPMed,,"3 prime UTR variant",,,,-,,,-,,,-,,,-,,,-,,,-,,ENST00000379160.3
rs1259475241,10666054,20:5114998,20:5114998,A,C/A,,,-,SNP,dbSNP,Frequency~gnomAD,,"3 prime UTR variant",,,,-,,,-,,,-,,,-,,,-,,,-,,ENST00000379160.3
rs930629892,5641539,20:5115004,20:5115004,T,A/T,,,-,SNP,dbSNP,Frequency~TOPMed,,"3 prime UTR variant",,,,-,,,-,,,-,,,-,,,-,,,-,,ENST00000379160.3
rs1448303090,14860008,20:5115007,20:5115007,A,G/A,,,-,SNP,dbSNP,Frequency~TOPMed,,"3 prime UTR variant",,,,-,,,-,,,-,,,-,,,-,,,-,,ENST00000379160.3
rs1403115501,13857951,20:5115013,20:5115013,G,A/G,,,-,SNP,dbSNP,Frequency~TOPMed,,"3 prime UTR variant",,,,-,,,-,,,-,,,-,,,-,,,-,,ENST00000379160.3
rs926562222,5554089,20:5115016,20:5115016,A,G/A,,,-,SNP,dbSNP,,,"3 prime UTR variant",,,,-,,,-,,,-,,,-,,,-,,,-,,ENST00000379160.3
rs1330075526,12233792,20:5115029,20:5115029,G,T/G,,,-,SNP,dbSNP,Frequency~TOPMed,,"3 prime UTR variant",,,,-,,,-,,,-,,,-,,,-,,,-,,ENST00000379160.3
rs939233585,5826730,20:5115048,20:5115048,A,G/A,,,-,SNP,dbSNP,Frequency~TOPMed~gnomAD,,"3 prime UTR variant",,,,-,,,-,,,-,,,-,,,-,,,-,,ENST00000379160.3
rs1209847033,9562791,20:5115060,20:5115060,A,G/A/C,,,-,SNP,dbSNP,Frequency~TOPMed~gnomAD,,"3 prime UTR variant",,,,-,,,-,,,-,,,-,,,-,,,-,,ENST00000379160.3
rs1209847033,9562791,20:5115060,20:5115060,C,G/A/C,,,-,SNP,dbSNP,Frequency~TOPMed~gnomAD,,"3 prime UTR variant",,,,-,,,-,,,-,,,-,,,-,,,-,,ENST00000379160.3
rs1174653231,8781081,20:5115061,20:5115061-5115062,-,AC/-,,,-,deletion,dbSNP,Frequency~TOPMed,,"3 prime UTR variant",,,,-,,,-,,,-,,,-,,,-,,,-,,ENST00000379160.3
rs1454900061,15009765,20:5115062,"20: between 5115062 & 5115063",A,-/A,,,-,insertion,dbSNP,Frequency~TOPMed,,"3 prime UTR variant",,,,-,,,-,,,-,,,-,,,-,,,-,,ENST00000379160.3
rs14453,1273778,20:5115066,20:5115066,T,A/T,,,-,SNP,dbSNP,Frequency~TOPMed,,"3 prime UTR variant",,,,-,,,-,,,-,,,-,,,-,,,-,,ENST00000379160.3
rs984033253,6790362,20:5115069,20:5115069,C,A/C,,,-,SNP,dbSNP,Frequency~TOPMed,,"3 prime UTR variant",,,,-,,,-,,,-,,,-,,,-,,,-,,ENST00000379160.3
rs1441556742,14711423,20:5115074,20:5115074,C,T/C,,,-,SNP,dbSNP,Frequency~TOPMed,,"3 prime UTR variant",,,,-,,,-,,,-,,,-,,,-,,,-,,ENST00000379160.3
rs1056398901,8347689,20:5115076,20:5115076,T,G/T,,,-,SNP,dbSNP,Frequency~TOPMed~gnomAD,,"3 prime UTR variant",,,,-,,,-,,,-,,,-,,,-,,,-,,ENST00000379160.3
rs909807108,5193400,20:5115077,20:5115077,A,G/A,,,-,SNP,dbSNP,Frequency~TOPMed,,"3 prime UTR variant",,,,-,,,-,,,-,,,-,,,-,,,-,,ENST00000379160.3
rs552802112,3212108,20:5115079,20:5115079,C,T/C,C,0.000199681,"< 0.001",SNP,dbSNP,Frequency~1000Genomes,,"3 prime UTR variant",,,,-,,,-,,,-,,,-,,,-,,,-,,ENST00000379160.3
rs1440619350,14691196,20:5115086,20:5115086,G,A/G,,,-,SNP,dbSNP,Frequency~TOPMed,,"3 prime UTR variant",,,,-,,,-,,,-,,,-,,,-,,,-,,ENST00000379160.3
rs1280537027,11130994,20:5115090,20:5115090,A,G/A,,,-,SNP,dbSNP,Frequency~TOPMed,,"3 prime UTR variant",,,,-,,,-,,,-,,,-,,,-,,,-,,ENST00000379160.3
rs1211296490,9594637,20:5115092,20:5115092,A,T/A,,,-,SNP,dbSNP,Frequency~TOPMed,,"3 prime UTR variant",,,,-,,,-,,,-,,,-,,,-,,,-,,ENST00000379160.3
rs1352573414,12733873,20:5115093,20:5115093,T,C/T,,,-,SNP,dbSNP,Frequency~TOPMed,,"3 prime UTR variant",,,,-,,,-,,,-,,,-,,,-,,,-,,ENST00000379160.3
rs1489693827,15781973,20:5115122,20:5115122,C,T/C,,,-,SNP,dbSNP,Frequency~TOPMed~gnomAD,,"3 prime UTR variant",,,,-,,,-,,,-,,,-,,,-,,,-,,ENST00000379160.3
rs3626,1273460,20:5115125,20:5115125,G,C/G,G,0.124601,0.125,SNP,dbSNP,Frequency~HapMap~1000Genomes~Cited~TOPMed~gnomAD,,"3 prime UTR variant",,,,-,,,-,,,-,,,-,,,-,,,-,,ENST00000379160.3
rs534273013,2802826,20:5115132,20:5115132,C,T/C,C,0.000599042,"< 0.001",SNP,dbSNP,Frequency~1000Genomes~TOPMed~gnomAD,,"3 prime UTR variant",,,,-,,,-,,,-,,,-,,,-,,,-,,ENST00000379160.3
rs8632,1273606,20:5115134,20:5115134,A,G/A,A,0.047524,0.048,SNP,dbSNP,Frequency~1000Genomes~TOPMed~gnomAD,,"3 prime UTR variant",,,,-,,,-,,,-,,,-,,,-,,,-,,ENST00000379160.3
rs1448004525,14853279,20:5115144,20:5115144,C,T/C,,,-,SNP,dbSNP,Frequency~TOPMed,,"3 prime UTR variant",,,,-,,,-,,,-,,,-,,,-,,,-,,ENST00000379160.3
rs949820791,6054068,20:5115146,20:5115146,A,G/A,,,-,SNP,dbSNP,Frequency~TOPMed,,"3 prime UTR variant",,,,-,,,-,,,-,,,-,,,-,,,-,,ENST00000379160.3
rs1336591370,12378734,20:5115154,20:5115154,G,A/G,,,-,SNP,dbSNP,Frequency~TOPMed,,"3 prime UTR variant",,,,-,,,-,,,-,,,-,,,-,,,-,,ENST00000379160.3
rs1044149724,8083847,20:5115157,20:5115157,A,G/A,,,-,SNP,dbSNP,Frequency~TOPMed~gnomAD,,"3 prime UTR variant",,,,-,,,-,,,-,,,-,,,-,,,-,,ENST00000379160.3
rs903906399,5066146,20:5115160,20:5115160,T,A/T,,,-,SNP,dbSNP,,,"3 prime UTR variant",,,,-,,,-,,,-,,,-,,,-,,,-,,ENST00000379160.3
rs200747799,2402861,20:5115164,20:5115164,G,A/G,G,0.000399361,"< 0.001",SNP,dbSNP,Frequency~1000Genomes~TOPMed,,"3 prime UTR variant",,,,-,,,-,,,-,,,-,,,-,,,-,,ENST00000379160.3
rs535170945,2822692,20:5115167,20:5115167,C,T/C,C,0.000199681,"< 0.001",SNP,dbSNP,Frequency~1000Genomes,,"3 prime UTR variant",,,,-,,,-,,,-,,,-,,,-,,,-,,ENST00000379160.3
rs1157007949,8389546,20:5115172,20:5115172,G,A/G,,,-,SNP,dbSNP,Frequency~TOPMed,,"3 prime UTR variant",,,,-,,,-,,,-,,,-,,,-,,,-,,ENST00000379160.3
rs556902668,3302556,20:5115181,20:5115181,C,T/C,C,0.000199681,"< 0.001",SNP,dbSNP,Frequency~1000Genomes,,"3 prime UTR variant",,,,-,,,-,,,-,,,-,,,-,,,-,,ENST00000379160.3
rs575383335,3710772,20:5115182,20:5115182,G,A/G,G,0.000199681,"< 0.001",SNP,dbSNP,Frequency~1000Genomes~TOPMed,,"3 prime UTR variant",,,,-,,,-,,,-,,,-,,,-,,,-,,ENST00000379160.3
rs1039181449,7976803,20:5115183,20:5115183,A,G/A,,,-,SNP,dbSNP,,,"3 prime UTR variant",,,,-,,,-,,,-,,,-,,,-,,,-,,ENST00000379160.3
rs1408886276,13985966,20:5115185,20:5115185,A,G/A,,,-,SNP,dbSNP,Frequency~TOPMed,,"3 prime UTR variant",,,,-,,,-,,,-,,,-,,,-,,,-,,ENST00000379160.3
rs545798337,3057945,20:5115189,20:5115189,T,C/T,T,0.000199681,"< 0.001",SNP,dbSNP,Frequency~1000Genomes,,"3 prime UTR variant",,,,-,,,-,,,-,,,-,,,-,,,-,,ENST00000379160.3
rs1032656898,7836610,20:5115192,20:5115192,C,A/C,,,-,SNP,dbSNP,Frequency~TOPMed,,"3 prime UTR variant",,,,-,,,-,,,-,,,-,,,-,,,-,,ENST00000379160.3
rs892045969,4810451,20:5115199,20:5115199,T,G/T,,,-,SNP,dbSNP,Frequency~TOPMed,,"3 prime UTR variant",,,,-,,,-,,,-,,,-,,,-,,,-,,ENST00000379160.3
rs902102178,5027226,20:5115200,20:5115200,G,A/G,,,-,SNP,dbSNP,Frequency~TOPMed,,"3 prime UTR variant",,,,-,,,-,,,-,,,-,,,-,,,-,,ENST00000379160.3
rs1188421403,9087129,20:5115201,20:5115201,A,C/A,,,-,SNP,dbSNP,Frequency~TOPMed,,"3 prime UTR variant",,,,-,,,-,,,-,,,-,,,-,,,-,,ENST00000379160.3
rs1363087648,12968771,20:5115204,20:5115204,-,A/-,,,-,deletion,dbSNP,Frequency~gnomAD,,"3 prime UTR variant",,,,-,,,-,,,-,,,-,,,-,,,-,,ENST00000379160.3
rs564379564,3467656,20:5115205,20:5115205,G,A/G,G,0.000199681,"< 0.001",SNP,dbSNP,Frequency~1000Genomes~TOPMed,,"3 prime UTR variant",,,,-,,,-,,,-,,,-,,,-,,,-,,ENST00000379160.3
rs577316337,3753240,20:5115208,20:5115208,T,G/T,T,,"< 0.001",SNP,dbSNP,Frequency~1000Genomes~TOPMed,,"3 prime UTR variant",,,,-,,,-,,,-,,,-,,,-,,,-,,ENST00000379160.3
rs764617171,4191310,20:5115214,20:5115214,C,A/C,,,-,SNP,dbSNP,Frequency~TOPMed,,"3 prime UTR variant",,,,-,,,-,,,-,,,-,,,-,,,-,,ENST00000379160.3
rs1157419404,8398738,20:5115232,20:5115232,G,A/G,,,-,SNP,dbSNP,Frequency~TOPMed~gnomAD,,"3 prime UTR variant",,,,-,,,-,,,-,,,-,,,-,,,-,,ENST00000379160.3
rs776825639,4454637,20:5115243,20:5115243,C,T/C,,,-,SNP,dbSNP,Frequency~ExAC~TOPMed~gnomAD,,"3 prime UTR variant",,,,-,,,-,,,-,,,-,,,-,,,-,,ENST00000379160.3
rs1226077539,9922507,20:5115245,20:5115245,G,A/G,,,-,SNP,dbSNP,Frequency~TOPMed,,"3 prime UTR variant",,,,-,,,-,,,-,,,-,,,-,,,-,,ENST00000379160.3
rs997757307,7086278,20:5115248,20:5115248,A,G/A,,,-,SNP,dbSNP,Frequency~gnomAD,,"3 prime UTR variant",,,,-,,,-,,,-,,,-,,,-,,,-,,ENST00000379160.3
rs1462455834,15177600,20:5115253,20:5115253,C,T/C,,,-,SNP,dbSNP,Frequency~gnomAD,,"3 prime UTR variant",,,,-,,,-,,,-,,,-,,,-,,,-,,ENST00000379160.3
rs1354889205,12786138,20:5115256,20:5115256-5115260,-,TTTTA/-,,,-,deletion,dbSNP,Frequency~TOPMed,,"3 prime UTR variant",,,,-,,,-,,,-,,,-,,,-,,,-,,ENST00000379160.3
rs1029779948,7774719,20:5115259,20:5115259,C,T/C,,,-,SNP,dbSNP,,,"3 prime UTR variant",,,,-,,,-,,,-,,,-,,,-,,,-,,ENST00000379160.3
rs759559882,4081951,20:5115262,20:5115262,C,T/C,,,-,SNP,dbSNP,Frequency~ExAC~gnomAD,,"3 prime UTR variant",,,,-,,,-,,,-,,,-,,,-,,,-,,ENST00000379160.3
rs541397756,2961048,20:5115266,20:5115266,C,T/C,C,0.000199681,"< 0.001",SNP,dbSNP,Frequency~1000Genomes~ExAC~TOPMed~gnomAD,,"3 prime UTR variant",,,,-,,,-,,,-,,,-,,,-,,,-,,ENST00000379160.3
rs775582825,4427905,20:5115268,20:5115268,C,G/C,,,-,SNP,dbSNP,Frequency~ExAC~gnomAD,,"3 prime UTR variant",,,,-,,,-,,,-,,,-,,,-,,,-,,ENST00000379160.3
rs1415784168,14137655,20:5115269,20:5115269,C,A/C,,,-,SNP,dbSNP,Frequency~TOPMed,,"3 prime UTR variant",,,,-,,,-,,,-,,,-,,,-,,,-,,ENST00000379160.3
rs771120963,4331411,20:5115270,"20: between 5115270 & 5115271",T,-/T,,,-,insertion,dbSNP,Frequency~ExAC~gnomAD,,"3 prime UTR variant",,,,-,,,-,,,-,,,-,,,-,,,-,,ENST00000379160.3
rs1375801067,13250931,20:5115276,20:5115276,G,A/G,,,-,SNP,dbSNP,Frequency~gnomAD,,"3 prime UTR variant",,,,-,,,-,,,-,,,-,,,-,,,-,,ENST00000379160.3
rs763207665,4160832,20:5115277,20:5115277,C,G/C,,,-,SNP,dbSNP,Frequency~ExAC~gnomAD,,"3 prime UTR variant",,,,-,,,-,,,-,,,-,,,-,,,-,,ENST00000379160.3
rs764607894,4191126,20:5115278,20:5115278,C,A/C/G,,,-,SNP,dbSNP,Frequency~ExAC~gnomAD,,"3 prime UTR variant",,,,-,,,-,,,-,,,-,,,-,,,-,,ENST00000379160.3
rs764607894,4191126,20:5115278,20:5115278,G,A/C/G,,,-,SNP,dbSNP,Frequency~ExAC~gnomAD,,"3 prime UTR variant",,,,-,,,-,,,-,,,-,,,-,,,-,,ENST00000379160.3
rs751963812,3917854,20:5115281,20:5115281,A,G/A,,,-,SNP,dbSNP,Frequency~ExAC~TOPMed~gnomAD,,"3 prime UTR variant",,,,-,,,-,,,-,,,-,,,-,,,-,,ENST00000379160.3
rs762445782,4144408,20:5115283,20:5115283,T,C/T,,,-,SNP,dbSNP,Frequency~ExAC~gnomAD,,"stop retained variant",*,262,,-,,,-,,,-,,,-,,,-,,,-,,ENST00000379160.3
rs1379097696,13324741,20:5115284,"20: between 5115284 & 5115285",AAG,-/AAG,,,-,insertion,dbSNP,Frequency~gnomAD,,"inframe insertion",*/S*,262,,-,,,-,,,-,,,-,,,-,,,-,,ENST00000379160.3
rs1296719526,11493983,20:5115288,20:5115288,G,A/G,,,-,SNP,dbSNP,Frequency~TOPMed,,"missense variant",S/P,261,11,"deleterious - low confidence",0.01,45,benign,0.044,24001,"likely benign",24,294,"likely benign",0.293,109,tolerated,0.108,113,neutral,0.112,ENST00000379160.3
COSM4634547,689732850,20:5115293,20:5115293,COSMIC_MUTATION,COSMIC_MUTATION,,,-,"somatic sequence alteration",COSMIC,Phenotype_or_Disease,,"coding sequence variant",,259,,-,,,-,,,-,,,-,,,-,,,-,,ENST00000379160.3
rs145675493,2020001,20:5115298,20:5115298,C,A/C/G,,,-,SNP,dbSNP,Frequency~ESP~ExAC~TOPMed~gnomAD,,"missense variant",D/E,257,471,tolerated,0.47,4,benign,0.003,22001,"likely benign",22,70,"likely benign",0.069,78,tolerated,0.077,164,neutral,0.163,ENST00000379160.3
rs145675493,2020001,20:5115298,20:5115298,G,A/C/G,,,-,SNP,dbSNP,Frequency~ESP~ExAC~TOPMed~gnomAD,,"synonymous variant",D,257,,-,,,-,,,-,,,-,,,-,,,-,,ENST00000379160.3
rs755609215,3996818,20:5115304,20:5115304,A,G/A,,,-,SNP,dbSNP,Frequency~ExAC~TOPMed~gnomAD,,"synonymous variant",I,255,,-,,,-,,,-,,,-,,,-,,,-,,ENST00000379160.3
COSM1028112,689732851,20:5115304,20:5115304,COSMIC_MUTATION,COSMIC_MUTATION,,,-,"somatic sequence alteration",COSMIC,Phenotype_or_Disease,,"coding sequence variant",,255,,-,,,-,,,-,,,-,,,-,,,-,,ENST00000379160.3
rs199716028,2382329,20:5115310,20:5115310,A,G/A,A,0.000199681,"< 0.001",SNP,dbSNP,Frequency~1000Genomes~ExAC~gnomAD,,"synonymous variant",P,253,,-,,,-,,,-,,,-,,,-,,,-,,ENST00000379160.3
COSM4712855,689732852,20:5115315,20:5115315,COSMIC_MUTATION,COSMIC_MUTATION,,,-,"somatic sequence alteration",COSMIC,Phenotype_or_Disease,,"coding sequence variant",,252,,-,,,-,,,-,,,-,,,-,,,-,,ENST00000379160.3
rs1234198343,10102601,20:5115316,20:5115316,T,C/T,,,-,SNP,dbSNP,Frequency~gnomAD,,"synonymous variant",L,251,,-,,,-,,,-,,,-,,,-,,,-,,ENST00000379160.3
rs753494859,3951151,20:5115325,20:5115325,C,T/C/G,,,-,SNP,dbSNP,Frequency~ExAC~gnomAD,,"synonymous variant",K,248,,-,,,-,,,-,,,-,,,-,,,-,,ENST00000379160.3
rs753494859,3951151,20:5115325,20:5115325,G,T/C/G,,,-,SNP,dbSNP,Frequency~ExAC~gnomAD,,"missense variant",K/N,248,11,deleterious,0.01,848,"possibly damaging",0.847,25001,"likely benign",25,255,"likely benign",0.254,262,tolerated,0.261,426,low,0.425,ENST00000379160.3
COSM1028113,689732853,20:5115331,20:5115331,COSMIC_MUTATION,COSMIC_MUTATION,,,-,"somatic sequence alteration",COSMIC,Phenotype_or_Disease,,"coding sequence variant",,246,,-,,,-,,,-,,,-,,,-,,,-,,ENST00000379160.3
rs754622048,3975527,20:5115333,20:5115333,A,G/A,,,-,SNP,dbSNP,Frequency~ExAC~gnomAD,,"missense variant",H/Y,246,1001,tolerated,1,19,benign,0.018,23001,"likely benign",23,196,"likely benign",0.195,97,tolerated,0.096,48,neutral,0.047,ENST00000379160.3
rs778720352,4495867,20:5115334,20:5115334,G,T/G,,,-,SNP,dbSNP,Frequency~ExAC~gnomAD,,"synonymous variant",G,245,,-,,,-,,,-,,,-,,,-,,,-,,ENST00000379160.3
rs747916514,3830680,20:5115337,20:5115337,T,C/T,,,-,SNP,dbSNP,Frequency~ExAC~gnomAD,,"missense variant",M/I,244,481,tolerated,0.48,10,benign,0.009,23001,"likely benign",23,154,"likely benign",0.153,121,tolerated,0.12,264,low,0.263,ENST00000379160.3
COSM3423731,689732854,20:5115338,20:5115338,COSMIC_MUTATION,COSMIC_MUTATION,,,-,"somatic sequence alteration",COSMIC,Phenotype_or_Disease,,"coding sequence variant",,244,,-,,,-,,,-,,,-,,,-,,,-,,ENST00000379160.3
rs771809068,4346329,20:5115339,20:5115339,C,T/C,,,-,SNP,dbSNP,Frequency~ExAC~gnomAD,,"missense variant",M/V,244,401,tolerated,0.4,34,benign,0.033,22001,"likely benign",22,119,"likely benign",0.118,190,tolerated,0.189,203,low,0.202,ENST00000379160.3
rs147737215,2058984,20:5115343,20:5115343,T,C/T,T,0.000599042,"< 0.001",SNP,dbSNP,Frequency~1000Genomes~ESP~ExAC~TOPMed~gnomAD,,"synonymous variant",A,242,,-,,,-,,,-,,,-,,,-,,,-,,ENST00000379160.3
rs746900735,3808733,20:5115344,20:5115344,A,G/A/T,,,-,SNP,dbSNP,Frequency~ExAC~TOPMed~gnomAD,,"missense variant",A/V,242,131,tolerated,0.13,29,benign,0.028,24001,"likely benign",24,98,"likely benign",0.097,210,tolerated,0.209,380,low,0.379,ENST00000379160.3
rs746900735,3808733,20:5115344,20:5115344,T,G/A/T,,,-,SNP,dbSNP,Frequency~ExAC~TOPMed~gnomAD,,"missense variant",A/E,242,941,tolerated,0.94,8,benign,0.007,23001,"likely benign",23,256,"likely benign",0.255,79,tolerated,0.078,31,neutral,0.03,ENST00000379160.3
rs984756437,6806040,20:5115345,20:5115345,T,C/T,,,-,SNP,dbSNP,Frequency~TOPMed,,"missense variant",A/T,242,281,tolerated,0.28,23,benign,0.022,22001,"likely benign",22,81,"likely benign",0.08,193,tolerated,0.192,340,low,0.339,ENST00000379160.3
rs1329634779,12224121,20:5115355,20:5115355,T,C/T,,,-,SNP,dbSNP,Frequency~TOPMed~gnomAD,,"synonymous variant",E,238,,-,,,-,,,-,,,-,,,-,,,-,,ENST00000379160.3
rs1477452484,15509560,20:5115361,20:5115361,G,A/G,,,-,SNP,dbSNP,Frequency~TOPMed,,"splice region variant~synonymous variant",V,236,,-,,,-,,,-,,,-,,,-,,,-,,ENST00000379160.3
rs769780505,4302600,20:5115362,20:5115362,G,A/G,,,-,SNP,dbSNP,Frequency~ExAC~gnomAD,,"missense variant~splice region variant",V/A,236,81,tolerated,0.08,870,"possibly damaging",0.869,21001,"likely benign",21,,-,,,-,,,-,,ENST00000379160.3
rs377256355,2624548,20:5115378,20:5115378,G,A/G,,,-,SNP,dbSNP,Frequency~ESP~ExAC~TOPMed~gnomAD,,"intron variant",,,,-,,,-,,,-,,,-,,,-,,,-,,ENST00000379160.3
rs1288019938,11299405,20:5115379,20:5115379,C,T/C,,,-,SNP,dbSNP,Frequency~TOPMed~gnomAD,,"intron variant",,,,-,,,-,,,-,,,-,,,-,,,-,,ENST00000379160.3
rs777063168,4459817,20:5115380,20:5115380,-,G/-,,,-,deletion,dbSNP,Frequency~ExAC,,"intron variant",,,,-,,,-,,,-,,,-,,,-,,,-,,ENST00000379160.3
rs763331660,4163537,20:5115385,20:5115385,C,A/C,,,-,SNP,dbSNP,Frequency~ExAC~gnomAD,,"intron variant",,,,-,,,-,,,-,,,-,,,-,,,-,,ENST00000379160.3
rs1486008380,15700878,20:5115387,20:5115387,A,T/A,,,-,SNP,dbSNP,Frequency~TOPMed,,"intron variant",,,,-,,,-,,,-,,,-,,,-,,,-,,ENST00000379160.3
rs768964791,4284929,20:5115389,20:5115389,A,C/A,,,-,SNP,dbSNP,Frequency~ExAC~gnomAD,,"intron variant",,,,-,,,-,,,-,,,-,,,-,,,-,,ENST00000379160.3
rs774900616,4413049,20:5115390,20:5115390,C,T/C,,,-,SNP,dbSNP,Frequency~ExAC~gnomAD,,"intron variant",,,,-,,,-,,,-,,,-,,,-,,,-,,ENST00000379160.3
rs762290541,4140996,20:5115393,20:5115393,A,G/A,,,-,SNP,dbSNP,Frequency~ExAC~gnomAD,,"intron variant",,,,-,,,-,,,-,,,-,,,-,,,-,,ENST00000379160.3
rs1263699231,10760484,20:5115398,20:5115398,C,A/C/G,,,-,SNP,dbSNP,Frequency~gnomAD,,"intron variant",,,,-,,,-,,,-,,,-,,,-,,,-,,ENST00000379160.3
rs1263699231,10760484,20:5115398,20:5115398,G,A/C/G,,,-,SNP,dbSNP,Frequency~gnomAD,,"intron variant",,,,-,,,-,,,-,,,-,,,-,,,-,,ENST00000379160.3
rs767882187,4261577,20:5115399,20:5115399,C,T/C,,,-,SNP,dbSNP,Frequency~ExAC~gnomAD,,"intron variant",,,,-,,,-,,,-,,,-,,,-,,,-,,ENST00000379160.3
rs1488200825,15749088,20:5115400,20:5115400,A,G/A,,,-,SNP,dbSNP,Frequency~gnomAD,,"intron variant",,,,-,,,-,,,-,,,-,,,-,,,-,,ENST00000379160.3
rs750897740,3894851,20:5115413,20:5115413,T,C/T,,,-,SNP,dbSNP,Frequency~ExAC~gnomAD,,"intron variant",,,,-,,,-,,,-,,,-,,,-,,,-,,ENST00000379160.3
rs1481810175,15606606,20:5115416,"20: between 5115416 & 5115417",CTACAAGGTACTACATATGA,-/CTACAAGGTACTACATATGA,,,-,insertion,dbSNP,Frequency~gnomAD,,"intron variant",,,,-,,,-,,,-,,,-,,,-,,,-,,ENST00000379160.3
rs761232690,4118085,20:5115419,20:5115419,G,A/G,,,-,SNP,dbSNP,Frequency~ExAC~gnomAD,,"intron variant",,,,-,,,-,,,-,,,-,,,-,,,-,,ENST00000379160.3
rs765873682,4218205,20:5115426,20:5115426,C,A/C,,,-,SNP,dbSNP,Frequency~ExAC~TOPMed~gnomAD,,"intron variant",,,,-,,,-,,,-,,,-,,,-,,,-,,ENST00000379160.3
rs753314933,3947175,20:5115428,20:5115428,A,G/A/T,,,-,SNP,dbSNP,Frequency~ExAC~gnomAD,,"intron variant",,,,-,,,-,,,-,,,-,,,-,,,-,,ENST00000379160.3
rs753314933,3947175,20:5115428,20:5115428,T,G/A/T,,,-,SNP,dbSNP,Frequency~ExAC~gnomAD,,"intron variant",,,,-,,,-,,,-,,,-,,,-,,,-,,ENST00000379160.3
rs754675113,3976703,20:5115429,20:5115429,T,G/T,,,-,SNP,dbSNP,Frequency~ExAC~TOPMed~gnomAD,,"intron variant",,,,-,,,-,,,-,,,-,,,-,,,-,,ENST00000379160.3
rs141343142,1937427,20:5115432,20:5115432,T,C/T,,,-,SNP,dbSNP,,,"intron variant",,,,-,,,-,,,-,,,-,,,-,,,-,,ENST00000379160.3
rs1322928779,12077106,20:5115435,20:5115435,G,A/G,,,-,SNP,dbSNP,Frequency~TOPMed,,"intron variant",,,,-,,,-,,,-,,,-,,,-,,,-,,ENST00000379160.3
rs762824400,4152515,20:5115437,20:5115437-5115439,-,TTA/-,,,-,deletion,dbSNP,Frequency~ExAC~TOPMed~gnomAD,,"intron variant",,,,-,,,-,,,-,,,-,,,-,,,-,,ENST00000379160.3
rs17353,1273842,20:5115453,20:5115453,A,G/A/C,C,0.00459265,0.005,SNP,dbSNP,Frequency~1000Genomes~ESP~ExAC~TOPMed~gnomAD,,"synonymous variant",P,234,,-,,,-,,,-,,,-,,,-,,,-,,ENST00000379160.3
rs17353,1273842,20:5115453,20:5115453,C,G/A/C,C,0.00459265,0.005,SNP,dbSNP,Frequency~1000Genomes~ESP~ExAC~TOPMed~gnomAD,,"synonymous variant",P,234,,-,,,-,,,-,,,-,,,-,,,-,,ENST00000379160.3
rs752310669,3925283,20:5115459,20:5115459,G,A/G,,,-,SNP,dbSNP,Frequency~ExAC~gnomAD,,"synonymous variant",D,232,,-,,,-,,,-,,,-,,,-,,,-,,ENST00000379160.3
rs1392081267,13613352,20:5115470,20:5115470,C,T/C,,,-,SNP,dbSNP,Frequency~gnomAD,,"missense variant",M/V,229,11,deleterious,0.01,48,benign,0.047,25001,"likely benign",25,388,"likely benign",0.387,365,tolerated,0.364,746,medium,0.745,ENST00000379160.3
rs369958038,2480953,20:5115472,20:5115472,A,C/A,,,-,SNP,dbSNP,Frequency~Cited~ESP~Phenotype_or_Disease~TOPMed~gnomAD,pathogenic,"missense variant",S/I,228,81,tolerated,0.08,713,"possibly damaging",0.712,27001,"likely benign",27,743,"likely disease causing",0.742,506,damaging,0.505,864,medium,0.863,ENST00000379160.3
COSM1028114,689732855,20:5115476,20:5115476,COSMIC_MUTATION,COSMIC_MUTATION,,,-,"somatic sequence alteration",COSMIC,Phenotype_or_Disease,,"coding sequence variant",,227,,-,,,-,,,-,,,-,,,-,,,-,,ENST00000379160.3
COSM4928755,689732856,20:5115477,20:5115477,COSMIC_MUTATION,COSMIC_MUTATION,,,-,"somatic sequence alteration",COSMIC,Phenotype_or_Disease,,"coding sequence variant",,226,,-,,,-,,,-,,,-,,,-,,,-,,ENST00000379160.3
rs1307654561,11738120,20:5115482,20:5115482,T,C/T,,,-,SNP,dbSNP,Frequency~gnomAD,,"missense variant",V/M,225,1,deleterious,0,1001,"probably damaging",1,27001,"likely benign",27,644,"likely disease causing",0.643,693,damaging,0.692,932,high,0.931,ENST00000379160.3
rs151245353,2125492,20:5115483,20:5115483,T,C/T,,,-,SNP,dbSNP,Frequency~ESP~ExAC~TOPMed~gnomAD,,"synonymous variant",T,224,,-,,,-,,,-,,,-,,,-,,,-,,ENST00000379160.3
rs878920538,4656637,20:5115484,20:5115484,A,G/A,,,-,SNP,dbSNP,Frequency~TOPMed~gnomAD,,"missense variant",T/M,224,121,tolerated,0.12,284,benign,0.283,23001,"likely benign",23,439,"likely benign",0.438,282,tolerated,0.281,324,low,0.323,ENST00000379160.3
COSM6741782,689732857,20:5115484,20:5115484,COSMIC_MUTATION,COSMIC_MUTATION,,,-,"somatic sequence alteration",COSMIC,Phenotype_or_Disease,,"coding sequence variant",,224,,-,,,-,,,-,,,-,,,-,,,-,,ENST00000379160.3