"Variant ID",vf,Location,"Chr: bp",Alleles,gmaf_allele,gmaf_freq,"Global MAF",Class,Source,Evidence,"Clin. Sig.","ClinVar ID",Consequence,phen_filter,Phenotype
rs1229674555,350168088,11:61203538,11:61203538-61203551,CCCTCGAGTTGGGA/-,,,-,deletion,dbSNP,Frequency~TOPMed,,-,"5 prime UTR variant",,-
rs751486931,336945692,11:61203551,11:61203551,A/-,,,-,deletion,dbSNP,Frequency~ExAC~gnomAD,,-,"5 prime UTR variant",,-
rs368750894,333719793,11:61203552,11:61203552,C/T,T,0.00259585,0.003,SNP,dbSNP,Frequency~1000Genomes~ESP~ExAC~TOPMed~gnomAD,,-,"5 prime UTR variant",,-
rs770723713,337855945,11:61203554,11:61203554,C/T,,,-,SNP,dbSNP,Frequency~ExAC~TOPMed~gnomAD,,-,"5 prime UTR variant",,-
rs373139279,333904923,11:61203555,11:61203555,G/A,A,0.00439297,0.004,SNP,dbSNP,Frequency~1000Genomes~ESP~ExAC~TOPMed~gnomAD,,-,"5 prime UTR variant",,-
rs759251321,337313186,11:61203557,11:61203557,G/C,,,-,SNP,dbSNP,Frequency~ExAC~TOPMed~gnomAD,,-,"5 prime UTR variant",,-
rs745619132,336668064,11:61203561,11:61203561,A/T,,,-,SNP,dbSNP,Frequency~ExAC~TOPMed~gnomAD,,-,"5 prime UTR variant",,-
rs774908034,338053673,11:61203562,11:61203562,A/G,,,-,SNP,dbSNP,Frequency~ExAC~gnomAD,,-,"5 prime UTR variant",,-
rs1333547098,355072866,11:61203563,11:61203563,C/T,,,-,SNP,dbSNP,Frequency~gnomAD,,-,"5 prime UTR variant",,-
rs760198544,337358156,11:61203564,11:61203564,C/A/T,,,-,SNP,dbSNP,Frequency~ExAC~gnomAD,,-,"5 prime UTR variant",,-
rs78669446,332109638,11:61203569,11:61203569,A/G,G,0.00159744,0.002,SNP,dbSNP,Frequency~1000Genomes~ESP~ExAC~TOPMed~gnomAD,,-,"missense variant",,-
rs1322424997,354549234,11:61203572,11:61203572,G/-,,,-,deletion,dbSNP,Frequency~gnomAD,,-,"frameshift variant",,-
rs1433417618,359791702,11:61203572,11:61203572,G/T,,,-,SNP,dbSNP,Frequency~TOPMed,,-,"missense variant",,-
COSM4561818,688004761,11:61203572,11:61203572,COSMIC_MUTATION,,,-,"somatic sequence alteration",COSMIC,Phenotype_or_Disease,,,"coding sequence variant","Skin tumour","Skin tumour"
rs757262333,337218916,11:61203572,"11: between 61203572 & 61203573",-/GCA,,,-,insertion,dbSNP,Frequency~ESP~ExAC~TOPMed,,-,"inframe insertion",,-
rs750964852,336920840,11:61203573,11:61203573,G/T,,,-,SNP,dbSNP,Frequency~ExAC~gnomAD,,-,"missense variant",,-
COSM6326026,688004762,11:61203573,11:61203573,COSMIC_MUTATION,,,-,"somatic sequence alteration",COSMIC,Phenotype_or_Disease,,,"coding sequence variant","Liver tumour","Liver tumour"
COSM5838957,688004763,11:61203573,11:61203573-61203575,COSMIC_MUTATION,,,-,"somatic sequence alteration",COSMIC,Phenotype_or_Disease,,,"coding sequence variant","NS tumour","NS tumour"
rs1249336147,351095264,11:61203574,11:61203574,C/T,,,-,SNP,dbSNP,Frequency~TOPMed,,-,"synonymous variant",,-
rs1179423424,347792820,11:61203575,11:61203575,T/C,,,-,SNP,dbSNP,Frequency~TOPMed,,-,"missense variant",,-
rs763498140,337513680,11:61203577,11:61203577,C/G,,,-,SNP,dbSNP,Frequency~ExAC~gnomAD,,-,"missense variant",,-
rs766859255,337672880,11:61203579,11:61203579,G/A/C,,,-,SNP,dbSNP,Frequency~ExAC~gnomAD,,-,"synonymous variant",,-
rs1483739441,362169684,11:61203580,11:61203580,C/G,,,-,SNP,dbSNP,Frequency~TOPMed,,-,"missense variant",,-
rs751971815,336968671,11:61203583,11:61203583,C/T,,,-,SNP,dbSNP,Frequency~ExAC~gnomAD,,-,"synonymous variant",,-
rs755310535,337126463,11:61203585,11:61203585,G/T,,,-,SNP,dbSNP,Frequency~ExAC~TOPMed~gnomAD,,-,"synonymous variant",,-
COSM689344,688004764,11:61203586,11:61203586,COSMIC_MUTATION,,,-,"somatic sequence alteration",COSMIC,Phenotype_or_Disease,,,"coding sequence variant","Lung tumour","Lung tumour"
rs376199189,334033741,11:61203587,11:61203587,G/T,,,-,SNP,dbSNP,Frequency~ESP,,-,"missense variant",,-
rs781454783,338362982,11:61203588,11:61203588,T/G,,,-,SNP,dbSNP,Frequency~ExAC~gnomAD,,-,"synonymous variant",,-
rs752761391,337006048,11:61203591,11:61203591,G/A,,,-,SNP,dbSNP,Frequency~ExAC~gnomAD,,-,"synonymous variant",,-
COSM929398,688004765,11:61203591,11:61203591,COSMIC_MUTATION,,,-,"somatic sequence alteration",COSMIC,Phenotype_or_Disease,,,"coding sequence variant","Endometrium tumour","Endometrium tumour"
rs756250788,337170986,11:61203592,11:61203592,G/A/C,,,-,SNP,dbSNP,Frequency~ExAC~TOPMed~gnomAD,,-,"missense variant",,-
rs777654861,338183647,11:61203595,11:61203595,G/A,,,-,SNP,dbSNP,Frequency~ExAC~TOPMed~gnomAD,,-,"missense variant",,-
rs1130676,331317282,11:61203597,11:61203597,A/C/G,,,-,SNP,dbSNP,Frequency~ExAC~TOPMed~gnomAD,,-,"synonymous variant",,-
rs1248758304,351068826,11:61203598,11:61203598,C/T,,,-,SNP,dbSNP,Frequency~TOPMed~gnomAD,,-,"missense variant",,-
rs1331930031,354994830,11:61203602,11:61203602,C/T,,,-,SNP,dbSNP,Frequency~TOPMed,,-,"missense variant",,-
COSM4034564,688004766,11:61203609,11:61203609,COSMIC_MUTATION,,,-,"somatic sequence alteration",COSMIC,Phenotype_or_Disease,,,"coding sequence variant","Stomach tumour","Stomach tumour"
rs1374639735,357014023,11:61203611,11:61203611,T/C,,,-,SNP,dbSNP,Frequency~gnomAD,,-,"missense variant",,-
rs145361518,332704010,11:61203614,11:61203614,T/C,,,-,SNP,dbSNP,Frequency~ESP~ExAC~TOPMed~gnomAD,,-,"missense variant",,-
rs745636543,336668866,11:61203615,11:61203615,G/A,,,-,SNP,dbSNP,Frequency~ExAC~TOPMed~gnomAD,,-,"missense variant",,-
rs771747618,337904210,11:61203620,11:61203620,A/G,,,-,SNP,dbSNP,Frequency~ExAC~gnomAD,,-,"missense variant",,-
rs1387953056,357640789,11:61203627,11:61203627,C/G,,,-,SNP,dbSNP,Frequency~TOPMed~gnomAD,,-,"splice region variant",,-
rs775236717,338069204,11:61203628,11:61203628,C/G/T,,,-,SNP,dbSNP,Frequency~ExAC~TOPMed~gnomAD,,-,"splice region variant",,-
rs536839949,334600049,11:61203629,11:61203629,G/A,A,0.000199681,"< 0.001",SNP,dbSNP,Frequency~1000Genomes~ExAC~TOPMed~gnomAD,,-,"non coding transcript exon variant",,-
rs775938917,338102577,11:61203631,11:61203631,G/A,,,-,SNP,dbSNP,Frequency~ExAC~gnomAD,,-,"non coding transcript exon variant",,-
rs370832218,333807463,11:61203633,11:61203633,G/A/C,,,-,SNP,dbSNP,Frequency~ESP~ExAC~TOPMed~gnomAD,,-,"non coding transcript exon variant",,-
rs766983806,337678640,11:61203634,11:61203634,G/A,,,-,SNP,dbSNP,Frequency~ExAC~gnomAD,,-,"non coding transcript exon variant",,-
rs774906289,338053564,11:61203635,11:61203635,T/C,,,-,SNP,dbSNP,Frequency~ExAC~gnomAD,,-,"non coding transcript exon variant",,-
rs1251198087,351180690,11:61203636,11:61203636,G/A,,,-,SNP,dbSNP,Frequency~TOPMed~gnomAD,,-,"non coding transcript exon variant",,-
rs1362915381,356461196,11:61203639,11:61203639,G/A,,,-,SNP,dbSNP,Frequency~TOPMed,,-,"non coding transcript exon variant",,-
rs1179535714,347797912,11:61203643,11:61203643,T/C,,,-,SNP,dbSNP,Frequency~TOPMed,,-,"non coding transcript exon variant",,-
rs759949783,337346438,11:61203649,11:61203649,C/T,,,-,SNP,dbSNP,Frequency~ExAC~TOPMed~gnomAD,,-,"non coding transcript exon variant",,-
rs767735197,337714452,11:61203650,11:61203650,G/T,,,-,SNP,dbSNP,Frequency~ExAC~TOPMed~gnomAD,,-,"non coding transcript exon variant",,-
rs908506600,339719180,11:61203651,11:61203651,C/T,,,-,SNP,dbSNP,Frequency~TOPMed,,-,"non coding transcript exon variant",,-
rs1442352726,360215443,11:61203661,11:61203661,C/T,,,-,SNP,dbSNP,Frequency~TOPMed,,-,"non coding transcript exon variant",,-
rs1254638570,351345850,11:61203672,11:61203672,T/C,,,-,SNP,dbSNP,Frequency~TOPMed,,-,"non coding transcript exon variant",,-
rs368726745,333718719,11:61203681,11:61203681,G/A,,,-,SNP,dbSNP,Frequency~ESP~TOPMed~gnomAD,,-,"non coding transcript exon variant",,-
rs555471629,335521089,11:61203685,11:61203685,C/A,A,0.00798722,0.008,SNP,dbSNP,Frequency~1000Genomes~TOPMed~gnomAD,,-,"non coding transcript exon variant",,-
rs1260401959,351617530,11:61203689,11:61203689,C/T,,,-,SNP,dbSNP,Frequency~TOPMed,,-,"non coding transcript exon variant",,-
rs543402750,334924264,11:61203697,"11: between 61203697 & 61203698",-/TT,TT,0.00319489,0.003,insertion,dbSNP,Frequency~1000Genomes~TOPMed~gnomAD,,-,"non coding transcript exon variant",,-
rs1610781,331334675,11:61203704,11:61203704,C/T,,,-,SNP,dbSNP,Frequency~TOPMed~gnomAD,,-,"non coding transcript exon variant",,-
rs1610443,331334669,11:61203707,11:61203707,C/T,,,-,SNP,dbSNP,Frequency~TOPMed~gnomAD,,-,"non coding transcript exon variant",,-
rs1414204684,358887492,11:61203708,11:61203708,C/T,,,-,SNP,dbSNP,Frequency~TOPMed,,-,"non coding transcript exon variant",,-
rs1610780,331334674,11:61203714,11:61203714,A/C/G,C,0.000798722,"< 0.001",SNP,dbSNP,Frequency~1000Genomes~TOPMed~gnomAD,,-,"non coding transcript exon variant",,-
rs1336069246,355189819,11:61203719,11:61203719,G/A/C,,,-,SNP,dbSNP,Frequency~TOPMed,,-,"non coding transcript exon variant",,-
rs1172643598,347471554,11:61203722,11:61203722,G/T,,,-,SNP,dbSNP,Frequency~gnomAD,,-,"non coding transcript exon variant",,-
rs941364757,341258275,11:61203724,11:61203724,C/A,,,-,SNP,dbSNP,Frequency~TOPMed,,-,"non coding transcript exon variant",,-
rs1156583308,346712987,11:61203729,"11: between 61203729 & 61203730",-/C,,,-,insertion,dbSNP,Frequency~TOPMed,,-,"non coding transcript exon variant",,-
rs187892909,333284041,11:61203738,11:61203738,T/A,A,0.00559105,0.006,SNP,dbSNP,Frequency~1000Genomes~TOPMed~gnomAD,,-,"non coding transcript exon variant",,-
rs192410287,333503326,11:61203739,11:61203739,C/A,A,0.00559105,0.006,SNP,dbSNP,Frequency~1000Genomes~TOPMed~gnomAD,,-,"non coding transcript exon variant",,-
rs183708165,333081040,11:61203740,11:61203740,C/T,T,0.0183706,0.018,SNP,dbSNP,Frequency~1000Genomes~TOPMed~gnomAD,,-,"non coding transcript exon variant",,-
rs540147247,334763416,11:61203741,11:61203741,G/A,A,0.000599042,"< 0.001",SNP,dbSNP,Frequency~1000Genomes~TOPMed~gnomAD,,-,"non coding transcript exon variant",,-
rs541206867,334815589,11:61203742,"11: between 61203742 & 61203743",-/CTCT,CTCT,0.00559105,0.006,insertion,dbSNP,Frequency~1000Genomes~TOPMed~gnomAD,,-,"non coding transcript exon variant",,-
rs1038504372,345804431,11:61203743,11:61203743-61203746,CTCT/-,,,-,deletion,dbSNP,Frequency~TOPMed,,-,"non coding transcript exon variant",,-
rs1443420405,360265850,11:61203744,11:61203744,T/C,,,-,SNP,dbSNP,Frequency~TOPMed,,-,"non coding transcript exon variant",,-
rs1247784794,351023998,11:61203748,11:61203748,T/C,,,-,SNP,dbSNP,Frequency~TOPMed,,-,"non coding transcript exon variant",,-
rs1313854509,354142799,11:61203756,11:61203756,T/C,,,-,SNP,dbSNP,Frequency~TOPMed~gnomAD,,-,"non coding transcript exon variant",,-
rs1466446427,361350483,11:61203759,11:61203759,T/C,,,-,SNP,dbSNP,Frequency~TOPMed,,-,"non coding transcript exon variant",,-
rs1268950254,352019706,11:61203769,11:61203769,G/C,,,-,SNP,dbSNP,Frequency~TOPMed,,-,"non coding transcript exon variant",,-
rs1227863402,350080653,11:61203770,11:61203770,C/T,,,-,SNP,dbSNP,Frequency~TOPMed,,-,"non coding transcript exon variant",,-
rs560025632,335746552,11:61203778,11:61203778,A/G,G,0.000199681,"< 0.001",SNP,dbSNP,Frequency~1000Genomes~gnomAD,,-,"non coding transcript exon variant",,-
rs1215744961,349512780,11:61203780,11:61203780,A/G,,,-,SNP,dbSNP,Frequency~gnomAD,,-,"non coding transcript exon variant",,-
rs905261003,339567196,11:61203782,11:61203782,G/A,,,-,SNP,dbSNP,Frequency~TOPMed,,-,"non coding transcript exon variant",,-
rs1295666869,353283068,11:61203783,11:61203783,G/A,,,-,SNP,dbSNP,Frequency~gnomAD,,-,"non coding transcript exon variant",,-
rs1002402654,344115653,11:61203786,11:61203786,A/-,,,-,deletion,dbSNP,Frequency~TOPMed,,-,"non coding transcript exon variant",,-
rs1306471109,353793052,11:61203786,11:61203786,A/G,,,-,SNP,dbSNP,Frequency~gnomAD,,-,"non coding transcript exon variant",,-
rs1245416766,350908013,11:61203792,11:61203792,C/T,,,-,SNP,dbSNP,Frequency~TOPMed,,-,"non coding transcript exon variant",,-
rs529027129,334214094,11:61203793,11:61203793,G/C,C,0.0117812,0.012,SNP,dbSNP,Frequency~1000Genomes~TOPMed~gnomAD,,-,"non coding transcript exon variant",,-
rs1257728559,351489591,11:61203794,11:61203794,G/A,,,-,SNP,dbSNP,Frequency~TOPMed~gnomAD,,-,"non coding transcript exon variant",,-
rs1436953120,359960649,11:61203795,11:61203795,G/T,,,-,SNP,dbSNP,Frequency~TOPMed,,-,"non coding transcript exon variant",,-
rs1461571806,361120873,11:61203799,11:61203799,A/G,,,-,SNP,dbSNP,Frequency~gnomAD,,-,"non coding transcript exon variant",,-
rs1388944865,357689099,11:61203803,11:61203803,T/C,,,-,SNP,dbSNP,Frequency~TOPMed,,-,"non coding transcript exon variant",,-
rs1202821159,348898037,11:61203806,11:61203806,C/A,,,-,SNP,dbSNP,Frequency~TOPMed~gnomAD,,-,"non coding transcript exon variant",,-
rs1242700841,350783829,11:61203808,11:61203808,G/C,,,-,SNP,dbSNP,Frequency~TOPMed~gnomAD,,-,"non coding transcript exon variant",,-
rs1056617371,346652672,11:61203816,11:61203816,C/T,,,-,SNP,dbSNP,Frequency~TOPMed,,-,"non coding transcript exon variant",,-
rs896753666,339168982,11:61203824,11:61203824,G/T,,,-,SNP,dbSNP,Frequency~TOPMed,,-,"non coding transcript exon variant",,-
rs1443017134,360246994,11:61203826,11:61203826,C/G,,,-,SNP,dbSNP,Frequency~TOPMed~gnomAD,,-,"non coding transcript exon variant",,-
rs1390057074,357741237,11:61203829,11:61203829,A/C,,,-,SNP,dbSNP,Frequency~TOPMed,,-,"non coding transcript exon variant",,-
rs1010193774,344479694,11:61203830,11:61203830,G/A,,,-,SNP,dbSNP,Frequency~TOPMed~gnomAD,,-,"non coding transcript exon variant",,-
rs1451695169,360654440,11:61203835,11:61203835,C/T,,,-,SNP,dbSNP,Frequency~TOPMed,,-,"non coding transcript exon variant",,-
rs1420303030,359173724,11:61203837,11:61203837,T/A,,,-,SNP,dbSNP,Frequency~TOPMed~gnomAD,,-,"non coding transcript exon variant",,-
rs542430346,334876203,11:61203847,11:61203847,G/A,A,0.00958466,0.010,SNP,dbSNP,Frequency~1000Genomes~TOPMed~gnomAD,,-,"non coding transcript exon variant",,-
rs1168918154,347294577,11:61203854,11:61203854,G/T,,,-,SNP,dbSNP,Frequency~TOPMed~gnomAD,,-,"non coding transcript exon variant",,-
rs1292138364,353117313,11:61203855,11:61203855,G/C,,,-,SNP,dbSNP,Frequency~TOPMed,,-,"non coding transcript exon variant",,-
rs562378558,335862903,11:61203856,11:61203856,G/T,T,0.00938498,0.009,SNP,dbSNP,Frequency~1000Genomes~TOPMed~gnomAD,,-,"non coding transcript exon variant",,-
rs1341402460,355440445,11:61203884,11:61203884,C/G,,,-,SNP,dbSNP,Frequency~TOPMed,,-,"non coding transcript exon variant",,-
rs1470472027,361542555,11:61203886,11:61203886,A/G,,,-,SNP,dbSNP,Frequency~TOPMed~gnomAD,,-,"non coding transcript exon variant",,-
rs1019955642,344935659,11:61203887,11:61203887,T/-,,,-,deletion,dbSNP,Frequency~TOPMed,,-,"non coding transcript exon variant",,-
rs1365620832,356586619,11:61203896,11:61203896,C/T,,,-,SNP,dbSNP,Frequency~TOPMed,,-,"non coding transcript exon variant",,-
rs1336487965,355209680,11:61203899,11:61203899,A/C,,,-,SNP,dbSNP,Frequency~TOPMed~gnomAD,,-,"non coding transcript exon variant",,-
rs1404442468,358422183,11:61203910,11:61203910,T/C,,,-,SNP,dbSNP,Frequency~gnomAD,,-,"non coding transcript exon variant",,-
rs1433837025,359811228,11:61203919,11:61203919,C/T,,,-,SNP,dbSNP,Frequency~TOPMed,,-,"non coding transcript exon variant",,-
rs1351200661,355906347,11:61203921,11:61203921,G/C,,,-,SNP,dbSNP,Frequency~TOPMed,,-,"non coding transcript exon variant",,-
rs1323680526,354607239,11:61203926,11:61203926,G/C,,,-,SNP,dbSNP,Frequency~TOPMed,,-,"non coding transcript exon variant",,-
rs531691701,334345400,11:61203931,11:61203931,G/T,T,0.00259585,0.003,SNP,dbSNP,Frequency~1000Genomes~TOPMed~gnomAD,,-,"non coding transcript exon variant",,-
rs1370533540,356818923,11:61203932,11:61203932,G/A,,,-,SNP,dbSNP,Frequency~TOPMed,,-,"non coding transcript exon variant",,-
rs1289136993,352975546,11:61203947,11:61203947,A/C,,,-,SNP,dbSNP,Frequency~TOPMed~gnomAD,,-,"non coding transcript exon variant",,-
rs1432085061,359730585,11:61203956,11:61203956,C/T,,,-,SNP,dbSNP,Frequency~TOPMed,,-,"non coding transcript exon variant",,-
rs1391153179,357790533,11:61203957,11:61203957,T/G,,,-,SNP,dbSNP,Frequency~TOPMed,,-,"non coding transcript exon variant",,-
rs1190913749,348336491,11:61203959,11:61203959,A/G,,,-,SNP,dbSNP,Frequency~TOPMed,,-,"non coding transcript exon variant",,-
rs1360623279,356353060,11:61203968,11:61203968,G/T,,,-,SNP,dbSNP,Frequency~TOPMed~gnomAD,,-,"non coding transcript exon variant",,-
rs1212323089,349348009,11:61203973,11:61203973,G/A,,,-,SNP,dbSNP,Frequency~TOPMed~gnomAD,,-,"non coding transcript exon variant",,-
rs1285062479,352783704,11:61203975,11:61203975,T/G,,,-,SNP,dbSNP,Frequency~TOPMed~gnomAD,,-,"non coding transcript exon variant",,-
rs1482758572,362122872,11:61203984,11:61203984,G/A,,,-,SNP,dbSNP,Frequency~TOPMed,,-,"non coding transcript exon variant",,-
rs1324204358,354631445,11:61203985,11:61203985,A/T,,,-,SNP,dbSNP,Frequency~TOPMed~gnomAD,,-,"non coding transcript exon variant",,-
rs1207207558,349105201,11:61203989,11:61203989,G/A,,,-,SNP,dbSNP,Frequency~TOPMed,,-,"non coding transcript exon variant",,-
rs1342682560,355503405,11:61203991,11:61203991,C/T,,,-,SNP,dbSNP,Frequency~TOPMed,,-,"non coding transcript exon variant",,-
rs1222605945,349835311,11:61203992,11:61203992,G/A,,,-,SNP,dbSNP,Frequency~TOPMed~gnomAD,,-,"non coding transcript exon variant",,-
rs1261020054,351645675,11:61203998,11:61203998,T/C,,,-,SNP,dbSNP,Frequency~TOPMed~gnomAD,,-,"non coding transcript exon variant",,-
rs967481448,342481692,11:61204001,11:61204001,C/G,,,-,SNP,dbSNP,Frequency~TOPMed,,-,"non coding transcript exon variant",,-
rs1275051982,352310622,11:61204035,11:61204035,C/-,,,-,deletion,dbSNP,Frequency~TOPMed,,-,"non coding transcript exon variant",,-
rs1395879298,358015548,11:61204045,11:61204045,G/C/T,,,-,SNP,dbSNP,Frequency~TOPMed~gnomAD,,-,"non coding transcript exon variant",,-
rs1218187280,349625545,11:61204054,11:61204054,G/A,,,-,SNP,dbSNP,Frequency~TOPMed~gnomAD,,-,"non coding transcript exon variant",,-
rs1292656026,353141328,11:61204059,11:61204059,C/T,,,-,SNP,dbSNP,Frequency~gnomAD,,-,"non coding transcript exon variant",,-
rs1490243993,362476803,11:61204060,11:61204060,G/A,,,-,SNP,dbSNP,Frequency~TOPMed~gnomAD,,-,"non coding transcript exon variant",,-
rs1197616781,348651137,11:61204061,11:61204061,G/A,,,-,SNP,dbSNP,Frequency~TOPMed~gnomAD,,-,"non coding transcript exon variant",,-
rs1371636892,356871305,11:61204069,11:61204069,A/C,,,-,SNP,dbSNP,Frequency~TOPMed,,-,"non coding transcript exon variant",,-
rs1175840744,347624157,11:61204074,11:61204074,T/A,,,-,SNP,dbSNP,Frequency~TOPMed,,-,"non coding transcript exon variant",,-
rs1264127769,351793369,11:61204095,11:61204095,T/C,,,-,SNP,dbSNP,Frequency~gnomAD,,-,"non coding transcript exon variant",,-
rs1428830516,359574856,11:61204110,11:61204110,C/A,,,-,SNP,dbSNP,Frequency~TOPMed~gnomAD,,-,"synonymous variant",,-
rs1427590789,359517437,11:61204118,11:61204118,T/A,,,-,SNP,dbSNP,Frequency~TOPMed,,-,"missense variant",,-
rs1192228736,348398755,11:61204123,11:61204123,A/C,,,-,SNP,dbSNP,Frequency~TOPMed~gnomAD,,-,"missense variant",,-
rs752976388,337016268,11:61204138,11:61204138,C/T,,,-,SNP,dbSNP,Frequency~ExAC~TOPMed~gnomAD,,-,"missense variant",,-
rs201875722,333650609,11:61204139,11:61204139,G/A,,,-,SNP,dbSNP,Frequency~ExAC~TOPMed~gnomAD,,-,"missense variant",,-
rs1163656220,347045980,11:61204140,11:61204140,C/T,,,-,SNP,dbSNP,Frequency~gnomAD,,-,"synonymous variant",,-
rs1184366918,348025711,11:61204144,11:61204144,C/T,,,-,SNP,dbSNP,Frequency~TOPMed,,-,"synonymous variant",,-
rs1364489678,356532422,11:61204146,11:61204146,G/A/C,,,-,SNP,dbSNP,Frequency~TOPMed~gnomAD,,-,"synonymous variant",,-
rs1236781385,350503732,11:61204149,11:61204149,C/G,,,-,SNP,dbSNP,Frequency~TOPMed,,-,"synonymous variant",,-
rs1422222613,359263092,11:61204150,11:61204150,G/A,,,-,SNP,dbSNP,Frequency~gnomAD,,-,"missense variant",,-
rs1299591409,353469147,11:61204153,11:61204153,C/T,,,-,SNP,dbSNP,Frequency~gnomAD,,-,"missense variant",,-
rs149184275,332851082,11:61204154,11:61204154,G/A,A,0.00319489,0.003,SNP,dbSNP,Frequency~1000Genomes~ESP~ExAC~TOPMed~gnomAD,,-,"missense variant",,-
rs1383088903,357410741,11:61204158,11:61204158,C/A,,,-,SNP,dbSNP,Frequency~gnomAD,,-,"synonymous variant",,-
rs1295364258,353268914,11:61204159,11:61204159,C/T,,,-,SNP,dbSNP,Frequency~gnomAD,,-,"synonymous variant",,-
rs753900810,337059945,11:61204160,11:61204160,T/A,,,-,SNP,dbSNP,Frequency~ExAC~gnomAD,,-,"missense variant",,-
rs1248876355,351074072,11:61204161,11:61204161,G/A,,,-,SNP,dbSNP,Frequency~gnomAD,,-,"synonymous variant",,-
rs1315813101,354235361,11:61204164,11:61204164,G/A,,,-,SNP,dbSNP,Frequency~gnomAD,,-,"synonymous variant",,-
rs1358734484,356262690,11:61204177,11:61204177,A/-,,,-,deletion,dbSNP,Frequency~gnomAD,,-,"frameshift variant",,-
rs757230651,337217422,11:61204188,11:61204188,C/A/G,,,-,SNP,dbSNP,Frequency~ExAC~gnomAD,,-,"missense variant",,-
rs1262660046,351722640,11:61204191,11:61204191,C/-,,,-,deletion,dbSNP,Frequency~gnomAD,,-,"frameshift variant",,-
rs778787486,338237025,11:61204193,11:61204193,A/G,,,-,SNP,dbSNP,Frequency~ExAC~TOPMed~gnomAD,,-,"missense variant",,-
rs1278972458,352496119,11:61204194,11:61204194,C/T,,,-,SNP,dbSNP,Frequency~TOPMed,,-,"synonymous variant",,-
rs745763143,336674800,11:61204200,11:61204200,C/G,,,-,SNP,dbSNP,Frequency~ExAC~gnomAD,,-,"synonymous variant",,-
rs1032745817,345534299,11:61204205,11:61204205,A/G,,,-,SNP,dbSNP,Frequency~TOPMed,,-,"missense variant",,-
rs767336412,337695547,11:61204211,"11: between 61204211 & 61204212",-/C,,,-,insertion,dbSNP,Frequency~ESP~ExAC~TOPMed~gnomAD,,-,"frameshift variant",,-
rs750301493,336889332,11:61204212,11:61204212,C/-,,,-,deletion,dbSNP,Frequency~ExAC,,-,"frameshift variant",,-
rs143331570,332625844,11:61204214,11:61204214,C/G,G,0.000399361,"< 0.001",SNP,dbSNP,Frequency~1000Genomes~ESP~ExAC~TOPMed~gnomAD,,-,"missense variant",,-
rs779660126,338278283,11:61204216,11:61204216,C/A,,,-,SNP,dbSNP,Frequency~ExAC~gnomAD,,-,"missense variant",,-
rs1184058561,348010942,11:61204219,11:61204219,T/A,,,-,SNP,dbSNP,Frequency~gnomAD,,-,"missense variant",,-
rs117494851,332392855,11:61204222,11:61204222,A/G,,,-,SNP,dbSNP,Frequency~ExAC~TOPMed~gnomAD,,-,"missense variant",,-
rs1384551834,357480030,11:61204223,"11: between 61204223 & 61204224",-/TC,,,-,insertion,dbSNP,Frequency~gnomAD,,-,"frameshift variant",,-
rs768193570,337736055,11:61204225,11:61204225,G/A,,,-,SNP,dbSNP,Frequency~ExAC~gnomAD,,-,"missense variant",,-
COSM139899,688004767,11:61204228,11:61204228,COSMIC_MUTATION,,,-,"somatic sequence alteration",COSMIC,Phenotype_or_Disease,,,"coding sequence variant","Skin tumour","Skin tumour"
rs776267157,338118039,11:61204230,11:61204230,C/T,,,-,SNP,dbSNP,Frequency~ExAC~gnomAD,,-,"synonymous variant",,-
rs1374727943,357018384,11:61204231,11:61204231,A/C,,,-,SNP,dbSNP,Frequency~TOPMed,,-,"missense variant",,-
COSM3809732,688004768,11:61204231,11:61204231,COSMIC_MUTATION,,,-,"somatic sequence alteration",COSMIC,Phenotype_or_Disease,,,"coding sequence variant","Breast tumour","Breast tumour"
rs747640131,336763184,11:61204232,11:61204232,C/A/G,,,-,SNP,dbSNP,Frequency~ExAC~TOPMed~gnomAD,,-,"missense variant",,-
rs1452666947,360700108,11:61204233,11:61204233,C/T,,,-,SNP,dbSNP,Frequency~gnomAD,,-,"synonymous variant",,-
rs1446337964,360402174,11:61204234,11:61204234,C/G,,,-,SNP,dbSNP,Frequency~TOPMed,,-,"missense variant",,-
rs775031186,338059456,11:61204237,11:61204237,G/A,,,-,SNP,dbSNP,Frequency~ExAC~gnomAD,,-,"missense variant",,-
rs760072428,337352234,11:61204240,11:61204240,G/A,,,-,SNP,dbSNP,Frequency~ExAC~TOPMed~gnomAD,,-,"missense variant",,-
rs1454920675,360806147,11:61204241,11:61204241,A/C,,,-,SNP,dbSNP,Frequency~gnomAD,,-,"missense variant",,-
rs1337709885,355268663,11:61204245,11:61204245,A/G,,,-,SNP,dbSNP,Frequency~TOPMed,,-,"synonymous variant",,-
rs559550682,335722965,11:61204250,11:61204250,C/T,,,-,SNP,dbSNP,Frequency~TOPMed~gnomAD,,-,"missense variant",,-
COSM3450660,688004769,11:61204250,11:61204250,COSMIC_MUTATION,,,-,"somatic sequence alteration",COSMIC,Phenotype_or_Disease,,,"coding sequence variant","Skin tumour","Skin tumour"
rs527696591,334148288,11:61204251,11:61204251,C/A,A,0.000798722,"< 0.001",SNP,dbSNP,Frequency~1000Genomes~TOPMed~gnomAD,,-,"synonymous variant",,-